{"text_format":"1","workbook":"xlsx","n_sheets":8,"sheets":["Datos","Otros Datos","CUPO","Departamentos","Acta Departamentos","TMP","TMP_Departamentos","AUX_Datos"],"not_rendered":{"charts":0,"images":0,"macros":1,"external_links":0,"defined_names":3,"comments":2,"pivot_tables":2},"unopened":[],"bounds":{"document_bytes":16777216,"sheet_cells":100000,"rows_first":2000,"rows_last":500,"rows_between":2000,"halvings":0,"cell_chars":16384,"cell_head_chars":4096},"cells_cut":0,"cells_raw":0,"read":"whole","date_system":"1900"}

{"sheet":"Datos","index":0,"n_rows":43,"n_cols":26,"rows_kept":43,"cut":false,"hidden":false,"merged":[[0,3,0,4],[0,7,0,8],[0,15,0,16],[0,23,0,24],[0,11,0,12],[0,19,0,20]]}
[null,null,"1º ESO","GRUPOS",null,null,"2º ESO","GRUPOS",null,null,"3º ESO","GRUPOS",null,null,"4º ESO","GRUPOS",null,null,"1º BACH","GRUPOS",null,null,"2º BACH","GRUPOS"]
["ASIGNATURA","DEPART","Nº HOR","OPT","GR OPT","TOT ","Nº HOR","OPT","GR OPT","TOT ","Nº HOR","OPT","GR OPT","TOT ","Nº HOR","OPT","GR OPT","TOT ","Nº HOR","OPT","GR OPT","TOT ","Nº HOR","OPT","GR OPT","TOT "]
["Biología",null,null,null,null,{"$f":"IF(EXACT(D3,\"N\"),C3*F$1,C3*E3)","v":0},null,null,null,{"$f":"IF(EXACT(H3,\"N\"),G3*J$1,G3*I3)","v":0},null,null,null,{"$f":"IF(EXACT(L3,\"N\"),K3*N$1,K3*M3)","v":0},null,null,null,{"$f":"IF(EXACT(P3,\"N\"),O3*R$1,O3*Q3)","v":0},null,null,null,{"$f":"IF(EXACT(T3,\"N\"),S3*V$1,S3*U3)","v":0},null,null,null,{"$f":"IF(EXACT(X3,\"N\"),W3*Z$1,W3*Y3)","v":0}]
["Dibujo",null,null,null,null,{"$f":"IF(EXACT(D4,\"N\"),C4*F$1,C4*E4)","v":0},null,null,null,0,null,null,null,0,null,null,null,0,null,null,null,0,null,null,null,0]
["Ed Fisica",null,null,null,null,0,null,null,null,0,null,null,null,0,null,null,null,0,null,null,null,0,null,null,null,0]
["Ética",null,null,null,null,0,null,null,null,0,null,null,null,0,null,null,null,0,null,null,null,0,null,null,null,0]
["Física y Quím",null,null,null,null,0,null,null,null,0,null,null,null,0,null,null,null,0,null,null,null,0,null,null,null,0]
["Francés",null,null,null,null,0,null,null,null,0,null,null,null,0,null,null,null,0,null,null,null,0,null,null,null,0]
["Geografía",null,null,null,null,0,null,null,null,0,null,null,null,0,null,null,null,0,null,null,null,0,null,null,null,0]
["Informática",null,null,null,null,0,null,null,null,0,null,null,null,0,null,null,null,0,null,null,null,0,null,null,null,0]
["Inglés",null,null,null,null,0,null,null,null,0,null,null,null,0,null,null,null,0,null,null,null,0,null,null,null,0]
["Lengua Cast",null,null,null,null,0,null,null,null,0,null,null,null,0,null,null,null,0,null,null,null,0,null,null,null,0]
["Matemáticas",null,null,null,null,0,null,null,null,0,null,null,null,0,null,null,null,0,null,null,null,0,null,null,null,0]
["Música",null,null,null,null,0,null,null,null,0,null,null,null,0,null,null,null,0,null,null,null,0,null,null,null,0]
["Tecnología",null,null,null,null,0,null,null,null,0,null,null,null,0,null,null,null,0,null,null,null,0,null,null,null,0]
["Taller Mat",null,null,null,null,0,null,null,null,0,null,null,null,0,null,null,null,0,null,null,null,0,null,null,null,0]
["taller Leng",null,null,null,null,0,null,null,null,0,null,null,null,0,null,null,null,0,null,null,null,0,null,null,null,0]
["Asign 1",null,null,null,null,0,null,null,null,0,null,null,null,0,null,null,null,0,null,null,null,0,null,null,null,0]
["Asign 2",null,null,null,null,0,null,null,null,0,null,null,null,0,null,null,null,0,null,null,null,0,null,null,null,0]
["Asign 3",null,null,null,null,0,null,null,null,0,null,null,null,0,null,null,null,0,null,null,null,0,null,null,null,0]
["Asign 4",null,null,null,null,0,null,null,null,0,null,null,null,0,null,null,null,0,null,null,null,0,null,null,null,0]
["Asign 5",null,null,null,null,0,null,null,null,0,null,null,null,0,null,null,null,0,null,null,null,0,null,null,null,0]
["Hist Relig",null,null,null,null,0,null,null,null,0,null,null,null,0,null,null,null,0,null,null,null,0,null,null,null,0]
["Ámbito CT",null,null,null,null,0,null,null,null,0,null,null,null,0,null,null,null,0,null,null,null,0,null,null,null,0]
["Ámbito SL",null,null,null,null,0,null,null,null,0,null,null,null,0,null,null,null,0,null,null,null,0,null,null,null,0]
["Economía",null,null,null,null,0,null,null,null,0,null,null,null,0,null,null,null,0,null,null,null,0,null,null,null,0]
["Ed Ciudadanía",null,null,null,null,0,null,null,null,0,null,null,null,0,null,null,null,0,null,null,null,0,null,null,null,0]
["Electrotecnia",null,null,null,null,0,null,null,null,0,null,null,null,0,null,null,null,0,null,null,null,0,null,null,null,0]
["Filosofía",null,null,null,null,0,null,null,null,0,null,null,null,0,null,null,null,0,null,null,null,0,null,null,null,0]
["Física ",null,null,null,null,0,null,null,null,0,null,null,null,0,null,null,null,0,null,null,null,0,null,null,null,0]
["FOL",null,null,null,null,0,null,null,null,0,null,null,null,0,null,null,null,0,null,null,null,0,null,null,null,0]
["Fundamentos",null,null,null,null,0,null,null,null,0,null,null,null,0,null,null,null,0,null,null,null,0,null,null,null,0]
["Geología",null,null,null,null,0,null,null,null,0,null,null,null,0,null,null,null,0,null,null,null,0,null,null,null,0]
["Griego",null,null,null,null,0,null,null,null,0,null,null,null,0,null,null,null,0,null,null,null,0,null,null,null,0]
["Historia",null,null,null,null,0,null,null,null,0,null,null,null,0,null,null,null,0,null,null,null,0,null,null,null,0]
["Historia Arte",null,null,null,null,0,null,null,null,0,null,null,null,0,null,null,null,0,null,null,null,0,null,null,null,0]
["Inglés Profes",null,null,null,null,0,null,null,null,0,null,null,null,0,null,null,null,0,null,null,null,0,null,null,null,0]
["Latín",null,null,null,null,0,null,null,null,0,null,null,null,0,null,null,null,0,null,null,null,0,null,null,null,0]
["Literatura",null,null,null,null,0,null,null,null,0,null,null,null,0,null,null,null,0,null,null,null,0,null,null,null,0]
["Mecánica",null,null,null,null,0,null,null,null,0,null,null,null,0,null,null,null,0,null,null,null,0,null,null,null,0]
["Psicología",null,null,null,null,0,null,null,null,0,null,null,null,0,null,null,null,0,null,null,null,0,null,null,null,0]
["Química",null,null,null,null,0,null,null,null,0,null,null,null,0,null,null,null,0,null,null,null,0,null,null,null,0]
["TOTAL CURSO",null,null,null,null,{"$f":"SUM(F3:F42)","v":0},null,null,null,{"$f":"SUM(J3:J42)","v":0},null,null,null,{"$f":"SUM(N3:N42)","v":0},null,null,null,{"$f":"SUM(R3:R42)","v":0},null,null,null,{"$f":"SUM(V3:V42)","v":0},null,null,null,{"$f":"SUM(Z3:Z42)","v":0}]

{"sheet":"Otros Datos","index":1,"n_rows":22,"n_cols":14,"rows_kept":22,"cut":false,"hidden":false,"merged":[]}
["DIRECCIÓN","Horas Direc","Depart",null,"OTROS","Horas ","Depart",null,"DEPART","Jef Depart",null,null,"Sí","S"]
["Director",null,null,null,"BIBLIOT",null,null,null,"Biología",null,null,null,"No","N"]
["Jefe Estud",null,null,null,"RIESG LAB",null,null,null,"Economía"]
["Jef Est Adj1",null,null,null,"RESP FORM",null,null,null,"Ed Física"]
["Jef Est Adj2",null,null,null,"EXTRAESC",null,null,null,"EPV"]
["Jef Est Adj 3",null,null,null,"TIC",null,null,null,"Filosofía"]
["Secret",null,null,null,"TOTAL",{"$f":"SUM(F2:F6)","v":0},null,null,"Física y Quim"]
["TOTAL",{"$f":"SUM(B2:B7)","v":0},null,null,null,null,null,null,"FOL"]
[null,null,null,null,null,null,null,null,"Francés"]
[null,null,null,null,null,null,null,null,"Geografía"]
[null,null,null,null,null,null,null,null,"Griego"]
[null,null,null,null,null,null,null,null,"Inglés"]
[null,null,null,null,null,null,null,null,"Latín"]
[null,null,null,null,null,null,null,null,"Lengua"]
[null,null,null,null,null,null,null,null,"Matemáticas"]
[null,null,null,null,null,null,null,null,"Música"]
[null,null,null,null,null,null,null,null,"Orientación"]
[null,null,null,null,null,null,null,null,"Tecnología"]
[null,null,null,null,null,null,null,null,"Depart 1"]
[null,null,null,null,null,null,null,null,"Depart 2"]
[null,null,null,null,null,null,null,null,"Depart 3"]
[null,null,null,null,null,null,null,null,"TOTAL",{"$f":"SUM(J2:J21)","v":0}]

{"sheet":"CUPO","index":2,"n_rows":24,"n_cols":27,"rows_kept":24,"cut":false,"hidden":false,"merged":[]}
["NOMBRE DEP","H LECT","DIRECC","JDEPRT","OTROS","TUTORÍAS","DESDOB","SIN REL","OTR ASIG","TOTALES","Nº PROF",null,"TUTORÍAS"]
[{"$f":"'Otros Datos'!I2","v":"Biología"},{"$f":"SUMIF(TMP!$B$2:$B$41,A2,TMP!$I$2:$I$41)","v":0},{"$f":"SUMIF('Otros Datos'!C$2:C$7,Tabla2[[#This Row],[NOMBRE DEP]],'Otros Datos'!B$2:B$7)","v":0},{"$f":"'Otros Datos'!J2","v":0},{"$f":"SUMIF('Otros Datos'!G$2:G$6,Tabla2[[#This Row],[NOMBRE DEP]],'Otros Datos'!F$2:F$6)","v":0},{"$f":"TMP_Departamentos!D2","v":0},null,{"$f":"TMP_Departamentos!E2","v":0},null,{"$f":"SUM(Tabla2[[#This Row],[H LECT]:[OTR ASIG]])","v":0},{"$f":"Tabla2[[#This Row],[TOTALES]]/HORAS_PROFESOR","v":0},null,"Curso","Grupos","Horas","Tutorías","Check","Grupo A","Grupo B","Grupo C","Grupo D","Grupo E","Grupo F","Grupo G","Grupo H","Grupo I","Grupo J"]
[{"$f":"'Otros Datos'!I3","v":"Economía"},{"$f":"SUMIF(TMP!$B$2:$B$41,A3,TMP!$I$2:$I$41)","v":0},{"$f":"SUMIF('Otros Datos'!C$2:C$7,Tabla2[[#This Row],[NOMBRE DEP]],'Otros Datos'!B$2:B$7)","v":0},{"$f":"'Otros Datos'!J3","v":0},{"$f":"SUMIF('Otros Datos'!G$2:G$6,Tabla2[[#This Row],[NOMBRE DEP]],'Otros Datos'!F$2:F$6)","v":0},{"$f":"TMP_Departamentos!D3","v":0},null,{"$f":"TMP_Departamentos!E3","v":0},null,{"$f":"SUM(Tabla2[[#This Row],[H LECT]:[OTR ASIG]])","v":0},{"$f":"Tabla2[[#This Row],[TOTALES]]/HORAS_PROFESOR","v":0},null,"1º ESO",null,null,{"$f":"Tabla4[[#This Row],[Grupos]]*Tabla4[[#This Row],[Horas]]","v":0},{"$f":"IF((10-COUNTBLANK(Tabla4[[#This Row],[Grupo A]:[Grupo J]]))<>Tabla4[[#This Row],[Grupos]],\"Revisar\",\"OK\")","v":"OK"}]
[{"$f":"'Otros Datos'!I4","v":"Ed Física"},{"$f":"SUMIF(TMP!$B$2:$B$41,A4,TMP!$I$2:$I$41)","v":0},{"$f":"SUMIF('Otros Datos'!C$2:C$7,Tabla2[[#This Row],[NOMBRE DEP]],'Otros Datos'!B$2:B$7)","v":0},{"$f":"'Otros Datos'!J4","v":0},{"$f":"SUMIF('Otros Datos'!G$2:G$6,Tabla2[[#This Row],[NOMBRE DEP]],'Otros Datos'!F$2:F$6)","v":0},{"$f":"TMP_Departamentos!D4","v":0},null,{"$f":"TMP_Departamentos!E4","v":0},null,{"$f":"SUM(Tabla2[[#This Row],[H LECT]:[OTR ASIG]])","v":0},{"$f":"Tabla2[[#This Row],[TOTALES]]/HORAS_PROFESOR","v":0},null,"2º ESO",null,null,{"$f":"Tabla4[[#This Row],[Grupos]]*Tabla4[[#This Row],[Horas]]","v":0},{"$f":"IF((10-COUNTBLANK(Tabla4[[#This Row],[Grupo A]:[Grupo J]]))<>Tabla4[[#This Row],[Grupos]],\"Revisar\",\"OK\")","v":"OK"}]
[{"$f":"'Otros Datos'!I5","v":"EPV"},{"$f":"SUMIF(TMP!$B$2:$B$41,A5,TMP!$I$2:$I$41)","v":0},{"$f":"SUMIF('Otros Datos'!C$2:C$7,Tabla2[[#This Row],[NOMBRE DEP]],'Otros Datos'!B$2:B$7)","v":0},{"$f":"'Otros Datos'!J5","v":0},{"$f":"SUMIF('Otros Datos'!G$2:G$6,Tabla2[[#This Row],[NOMBRE DEP]],'Otros Datos'!F$2:F$6)","v":0},{"$f":"TMP_Departamentos!D5","v":0},null,{"$f":"TMP_Departamentos!E5","v":0},null,{"$f":"SUM(Tabla2[[#This Row],[H LECT]:[OTR ASIG]])","v":0},{"$f":"Tabla2[[#This Row],[TOTALES]]/HORAS_PROFESOR","v":0},null,"3º ESO",null,null,{"$f":"Tabla4[[#This Row],[Grupos]]*Tabla4[[#This Row],[Horas]]","v":0},{"$f":"IF((10-COUNTBLANK(Tabla4[[#This Row],[Grupo A]:[Grupo J]]))<>Tabla4[[#This Row],[Grupos]],\"Revisar\",\"OK\")","v":"OK"}]
[{"$f":"'Otros Datos'!I6","v":"Filosofía"},{"$f":"SUMIF(TMP!$B$2:$B$41,A6,TMP!$I$2:$I$41)","v":0},{"$f":"SUMIF('Otros Datos'!C$2:C$7,Tabla2[[#This Row],[NOMBRE DEP]],'Otros Datos'!B$2:B$7)","v":0},{"$f":"'Otros Datos'!J6","v":0},{"$f":"SUMIF('Otros Datos'!G$2:G$6,Tabla2[[#This Row],[NOMBRE DEP]],'Otros Datos'!F$2:F$6)","v":0},{"$f":"TMP_Departamentos!D6","v":0},null,{"$f":"TMP_Departamentos!E6","v":0},null,{"$f":"SUM(Tabla2[[#This Row],[H LECT]:[OTR ASIG]])","v":0},{"$f":"Tabla2[[#This Row],[TOTALES]]/HORAS_PROFESOR","v":0},null,"4 º ESO",null,null,{"$f":"Tabla4[[#This Row],[Grupos]]*Tabla4[[#This Row],[Horas]]","v":0},{"$f":"IF((10-COUNTBLANK(Tabla4[[#This Row],[Grupo A]:[Grupo J]]))<>Tabla4[[#This Row],[Grupos]],\"Revisar\",\"OK\")","v":"OK"}]
[{"$f":"'Otros Datos'!I7","v":"Física y Quim"},{"$f":"SUMIF(TMP!$B$2:$B$41,A7,TMP!$I$2:$I$41)","v":0},{"$f":"SUMIF('Otros Datos'!C$2:C$7,Tabla2[[#This Row],[NOMBRE DEP]],'Otros Datos'!B$2:B$7)","v":0},{"$f":"'Otros Datos'!J7","v":0},{"$f":"SUMIF('Otros Datos'!G$2:G$6,Tabla2[[#This Row],[NOMBRE DEP]],'Otros Datos'!F$2:F$6)","v":0},{"$f":"TMP_Departamentos!D7","v":0},null,{"$f":"TMP_Departamentos!E7","v":0},null,{"$f":"SUM(Tabla2[[#This Row],[H LECT]:[OTR ASIG]])","v":0},{"$f":"Tabla2[[#This Row],[TOTALES]]/HORAS_PROFESOR","v":0},null,"1º BACH",null,null,{"$f":"Tabla4[[#This Row],[Grupos]]*Tabla4[[#This Row],[Horas]]","v":0},{"$f":"IF((10-COUNTBLANK(Tabla4[[#This Row],[Grupo A]:[Grupo J]]))<>Tabla4[[#This Row],[Grupos]],\"Revisar\",\"OK\")","v":"OK"}]
[{"$f":"'Otros Datos'!I8","v":"FOL"},{"$f":"SUMIF(TMP!$B$2:$B$41,A8,TMP!$I$2:$I$41)","v":0},{"$f":"SUMIF('Otros Datos'!C$2:C$7,Tabla2[[#This Row],[NOMBRE DEP]],'Otros Datos'!B$2:B$7)","v":0},{"$f":"'Otros Datos'!J8","v":0},{"$f":"SUMIF('Otros Datos'!G$2:G$6,Tabla2[[#This Row],[NOMBRE DEP]],'Otros Datos'!F$2:F$6)","v":0},{"$f":"TMP_Departamentos!D8","v":0},null,{"$f":"TMP_Departamentos!E8","v":0},null,{"$f":"SUM(Tabla2[[#This Row],[H LECT]:[OTR ASIG]])","v":0},{"$f":"Tabla2[[#This Row],[TOTALES]]/HORAS_PROFESOR","v":0},null,"2º BACH",null,null,{"$f":"Tabla4[[#This Row],[Grupos]]*Tabla4[[#This Row],[Horas]]","v":0},{"$f":"IF((10-COUNTBLANK(Tabla4[[#This Row],[Grupo A]:[Grupo J]]))<>Tabla4[[#This Row],[Grupos]],\"Revisar\",\"OK\")","v":"OK"}]
[{"$f":"'Otros Datos'!I9","v":"Francés"},{"$f":"SUMIF(TMP!$B$2:$B$41,A9,TMP!$I$2:$I$41)","v":0},{"$f":"SUMIF('Otros Datos'!C$2:C$7,Tabla2[[#This Row],[NOMBRE DEP]],'Otros Datos'!B$2:B$7)","v":0},{"$f":"'Otros Datos'!J9","v":0},{"$f":"SUMIF('Otros Datos'!G$2:G$6,Tabla2[[#This Row],[NOMBRE DEP]],'Otros Datos'!F$2:F$6)","v":0},{"$f":"TMP_Departamentos!D9","v":0},null,{"$f":"TMP_Departamentos!E9","v":0},null,{"$f":"SUM(Tabla2[[#This Row],[H LECT]:[OTR ASIG]])","v":0},{"$f":"Tabla2[[#This Row],[TOTALES]]/HORAS_PROFESOR","v":0},null,"PMAR 1",null,null,{"$f":"Tabla4[[#This Row],[Grupos]]*Tabla4[[#This Row],[Horas]]","v":0},{"$f":"IF((10-COUNTBLANK(Tabla4[[#This Row],[Grupo A]:[Grupo J]]))<>Tabla4[[#This Row],[Grupos]],\"Revisar\",\"OK\")","v":"OK"}]
[{"$f":"'Otros Datos'!I10","v":"Geografía"},{"$f":"SUMIF(TMP!$B$2:$B$41,A10,TMP!$I$2:$I$41)","v":0},{"$f":"SUMIF('Otros Datos'!C$2:C$7,Tabla2[[#This Row],[NOMBRE DEP]],'Otros Datos'!B$2:B$7)","v":0},{"$f":"'Otros Datos'!J10","v":0},{"$f":"SUMIF('Otros Datos'!G$2:G$6,Tabla2[[#This Row],[NOMBRE DEP]],'Otros Datos'!F$2:F$6)","v":0},{"$f":"TMP_Departamentos!D10","v":0},null,{"$f":"TMP_Departamentos!E10","v":0},null,{"$f":"SUM(Tabla2[[#This Row],[H LECT]:[OTR ASIG]])","v":0},{"$f":"Tabla2[[#This Row],[TOTALES]]/HORAS_PROFESOR","v":0},null,"PMAR 2",null,null,{"$f":"Tabla4[[#This Row],[Grupos]]*Tabla4[[#This Row],[Horas]]","v":0},{"$f":"IF((10-COUNTBLANK(Tabla4[[#This Row],[Grupo A]:[Grupo J]]))<>Tabla4[[#This Row],[Grupos]],\"Revisar\",\"OK\")","v":"OK"}]
[{"$f":"'Otros Datos'!I11","v":"Griego"},{"$f":"SUMIF(TMP!$B$2:$B$41,A11,TMP!$I$2:$I$41)","v":0},{"$f":"SUMIF('Otros Datos'!C$2:C$7,Tabla2[[#This Row],[NOMBRE DEP]],'Otros Datos'!B$2:B$7)","v":0},{"$f":"'Otros Datos'!J11","v":0},{"$f":"SUMIF('Otros Datos'!G$2:G$6,Tabla2[[#This Row],[NOMBRE DEP]],'Otros Datos'!F$2:F$6)","v":0},{"$f":"TMP_Departamentos!D11","v":0},null,{"$f":"TMP_Departamentos!E11","v":0},null,{"$f":"SUM(Tabla2[[#This Row],[H LECT]:[OTR ASIG]])","v":0},{"$f":"Tabla2[[#This Row],[TOTALES]]/HORAS_PROFESOR","v":0}]
[{"$f":"'Otros Datos'!I12","v":"Inglés"},{"$f":"SUMIF(TMP!$B$2:$B$41,A12,TMP!$I$2:$I$41)","v":0},{"$f":"SUMIF('Otros Datos'!C$2:C$7,Tabla2[[#This Row],[NOMBRE DEP]],'Otros Datos'!B$2:B$7)","v":0},{"$f":"'Otros Datos'!J12","v":0},{"$f":"SUMIF('Otros Datos'!G$2:G$6,Tabla2[[#This Row],[NOMBRE DEP]],'Otros Datos'!F$2:F$6)","v":0},{"$f":"TMP_Departamentos!D12","v":0},null,{"$f":"TMP_Departamentos!E12","v":0},null,{"$f":"SUM(Tabla2[[#This Row],[H LECT]:[OTR ASIG]])","v":0},{"$f":"Tabla2[[#This Row],[TOTALES]]/HORAS_PROFESOR","v":0},null,"SIN RELIGIÓN"]
[{"$f":"'Otros Datos'!I13","v":"Latín"},{"$f":"SUMIF(TMP!$B$2:$B$41,A13,TMP!$I$2:$I$41)","v":0},{"$f":"SUMIF('Otros Datos'!C$2:C$7,Tabla2[[#This Row],[NOMBRE DEP]],'Otros Datos'!B$2:B$7)","v":0},{"$f":"'Otros Datos'!J13","v":0},{"$f":"SUMIF('Otros Datos'!G$2:G$6,Tabla2[[#This Row],[NOMBRE DEP]],'Otros Datos'!F$2:F$6)","v":0},{"$f":"TMP_Departamentos!D13","v":0},null,{"$f":"TMP_Departamentos!E13","v":0},null,{"$f":"SUM(Tabla2[[#This Row],[H LECT]:[OTR ASIG]])","v":0},{"$f":"Tabla2[[#This Row],[TOTALES]]/HORAS_PROFESOR","v":0},null,"Curso","Grupos","Horas","SIN REL","Check","Grupo A","Grupo B","Grupo C","Grupo D","Grupo E","Grupo F","Grupo G","Grupo H","Grupo I","Grupo J"]
[{"$f":"'Otros Datos'!I14","v":"Lengua"},{"$f":"SUMIF(TMP!$B$2:$B$41,A14,TMP!$I$2:$I$41)","v":0},{"$f":"SUMIF('Otros Datos'!C$2:C$7,Tabla2[[#This Row],[NOMBRE DEP]],'Otros Datos'!B$2:B$7)","v":0},{"$f":"'Otros Datos'!J14","v":0},{"$f":"SUMIF('Otros Datos'!G$2:G$6,Tabla2[[#This Row],[NOMBRE DEP]],'Otros Datos'!F$2:F$6)","v":0},{"$f":"TMP_Departamentos!D14","v":0},null,{"$f":"TMP_Departamentos!E14","v":0},null,{"$f":"SUM(Tabla2[[#This Row],[H LECT]:[OTR ASIG]])","v":0},{"$f":"Tabla2[[#This Row],[TOTALES]]/HORAS_PROFESOR","v":0},null,"1º ESO",null,null,{"$f":"Tabla5[[#This Row],[Grupos]]*Tabla5[[#This Row],[Horas]]","v":0},{"$f":"IF((10-COUNTBLANK(Tabla5[[#This Row],[Grupo A]:[Grupo J]]))<>Tabla5[[#This Row],[Grupos]],\"Revisar\",\"OK\")","v":"OK"}]
[{"$f":"'Otros Datos'!I15","v":"Matemáticas"},{"$f":"SUMIF(TMP!$B$2:$B$41,A15,TMP!$I$2:$I$41)","v":0},{"$f":"SUMIF('Otros Datos'!C$2:C$7,Tabla2[[#This Row],[NOMBRE DEP]],'Otros Datos'!B$2:B$7)","v":0},{"$f":"'Otros Datos'!J15","v":0},{"$f":"SUMIF('Otros Datos'!G$2:G$6,Tabla2[[#This Row],[NOMBRE DEP]],'Otros Datos'!F$2:F$6)","v":0},{"$f":"TMP_Departamentos!D15","v":0},null,{"$f":"TMP_Departamentos!E15","v":0},null,{"$f":"SUM(Tabla2[[#This Row],[H LECT]:[OTR ASIG]])","v":0},{"$f":"Tabla2[[#This Row],[TOTALES]]/HORAS_PROFESOR","v":0},null,"2º ESO",null,null,{"$f":"Tabla5[[#This Row],[Grupos]]*Tabla5[[#This Row],[Horas]]","v":0},{"$f":"IF((10-COUNTBLANK(Tabla5[[#This Row],[Grupo A]:[Grupo J]]))<>Tabla5[[#This Row],[Grupos]],\"Revisar\",\"OK\")","v":"OK"}]
[{"$f":"'Otros Datos'!I16","v":"Música"},{"$f":"SUMIF(TMP!$B$2:$B$41,A16,TMP!$I$2:$I$41)","v":0},{"$f":"SUMIF('Otros Datos'!C$2:C$7,Tabla2[[#This Row],[NOMBRE DEP]],'Otros Datos'!B$2:B$7)","v":0},{"$f":"'Otros Datos'!J16","v":0},{"$f":"SUMIF('Otros Datos'!G$2:G$6,Tabla2[[#This Row],[NOMBRE DEP]],'Otros Datos'!F$2:F$6)","v":0},{"$f":"TMP_Departamentos!D16","v":0},null,{"$f":"TMP_Departamentos!E16","v":0},null,{"$f":"SUM(Tabla2[[#This Row],[H LECT]:[OTR ASIG]])","v":0},{"$f":"Tabla2[[#This Row],[TOTALES]]/HORAS_PROFESOR","v":0},null,"3º ESO",null,null,{"$f":"Tabla5[[#This Row],[Grupos]]*Tabla5[[#This Row],[Horas]]","v":0},{"$f":"IF((10-COUNTBLANK(Tabla5[[#This Row],[Grupo A]:[Grupo J]]))<>Tabla5[[#This Row],[Grupos]],\"Revisar\",\"OK\")","v":"OK"}]
[{"$f":"'Otros Datos'!I17","v":"Orientación"},{"$f":"SUMIF(TMP!$B$2:$B$41,A17,TMP!$I$2:$I$41)","v":0},{"$f":"SUMIF('Otros Datos'!C$2:C$7,Tabla2[[#This Row],[NOMBRE DEP]],'Otros Datos'!B$2:B$7)","v":0},{"$f":"'Otros Datos'!J17","v":0},{"$f":"SUMIF('Otros Datos'!G$2:G$6,Tabla2[[#This Row],[NOMBRE DEP]],'Otros Datos'!F$2:F$6)","v":0},{"$f":"TMP_Departamentos!D17","v":0},null,{"$f":"TMP_Departamentos!E17","v":0},null,{"$f":"SUM(Tabla2[[#This Row],[H LECT]:[OTR ASIG]])","v":0},{"$f":"Tabla2[[#This Row],[TOTALES]]/HORAS_PROFESOR","v":0},null,"4 º ESO",null,null,{"$f":"Tabla5[[#This Row],[Grupos]]*Tabla5[[#This Row],[Horas]]","v":0},{"$f":"IF((10-COUNTBLANK(Tabla5[[#This Row],[Grupo A]:[Grupo J]]))<>Tabla5[[#This Row],[Grupos]],\"Revisar\",\"OK\")","v":"OK"}]
[{"$f":"'Otros Datos'!I18","v":"Tecnología"},{"$f":"SUMIF(TMP!$B$2:$B$41,A18,TMP!$I$2:$I$41)","v":0},{"$f":"SUMIF('Otros Datos'!C$2:C$7,Tabla2[[#This Row],[NOMBRE DEP]],'Otros Datos'!B$2:B$7)","v":0},{"$f":"'Otros Datos'!J18","v":0},{"$f":"SUMIF('Otros Datos'!G$2:G$6,Tabla2[[#This Row],[NOMBRE DEP]],'Otros Datos'!F$2:F$6)","v":0},{"$f":"TMP_Departamentos!D18","v":0},null,{"$f":"TMP_Departamentos!E18","v":0},null,{"$f":"SUM(Tabla2[[#This Row],[H LECT]:[OTR ASIG]])","v":0},{"$f":"Tabla2[[#This Row],[TOTALES]]/HORAS_PROFESOR","v":0},null,"1º BACH",null,null,{"$f":"Tabla5[[#This Row],[Grupos]]*Tabla5[[#This Row],[Horas]]","v":0},{"$f":"IF((10-COUNTBLANK(Tabla5[[#This Row],[Grupo A]:[Grupo J]]))<>Tabla5[[#This Row],[Grupos]],\"Revisar\",\"OK\")","v":"OK"}]
[{"$f":"'Otros Datos'!I19","v":"Depart 1"},{"$f":"SUMIF(TMP!$B$2:$B$41,A19,TMP!$I$2:$I$41)","v":0},{"$f":"SUMIF('Otros Datos'!C$2:C$7,Tabla2[[#This Row],[NOMBRE DEP]],'Otros Datos'!B$2:B$7)","v":0},{"$f":"'Otros Datos'!J19","v":0},{"$f":"SUMIF('Otros Datos'!G$2:G$6,Tabla2[[#This Row],[NOMBRE DEP]],'Otros Datos'!F$2:F$6)","v":0},{"$f":"TMP_Departamentos!D19","v":0},null,{"$f":"TMP_Departamentos!E19","v":0},null,{"$f":"SUM(Tabla2[[#This Row],[H LECT]:[OTR ASIG]])","v":0},{"$f":"Tabla2[[#This Row],[TOTALES]]/HORAS_PROFESOR","v":0},null,"2º BACH",null,null,{"$f":"Tabla5[[#This Row],[Grupos]]*Tabla5[[#This Row],[Horas]]","v":0},{"$f":"IF((10-COUNTBLANK(Tabla5[[#This Row],[Grupo A]:[Grupo J]]))<>Tabla5[[#This Row],[Grupos]],\"Revisar\",\"OK\")","v":"OK"}]
[{"$f":"'Otros Datos'!I20","v":"Depart 2"},{"$f":"SUMIF(TMP!$B$2:$B$41,A20,TMP!$I$2:$I$41)","v":0},{"$f":"SUMIF('Otros Datos'!C$2:C$7,Tabla2[[#This Row],[NOMBRE DEP]],'Otros Datos'!B$2:B$7)","v":0},{"$f":"'Otros Datos'!J20","v":0},{"$f":"SUMIF('Otros Datos'!G$2:G$6,Tabla2[[#This Row],[NOMBRE DEP]],'Otros Datos'!F$2:F$6)","v":0},{"$f":"TMP_Departamentos!D20","v":0},null,{"$f":"TMP_Departamentos!E20","v":0},null,{"$f":"SUM(Tabla2[[#This Row],[H LECT]:[OTR ASIG]])","v":0},{"$f":"Tabla2[[#This Row],[TOTALES]]/HORAS_PROFESOR","v":0}]
[{"$f":"'Otros Datos'!I21","v":"Depart 3"},{"$f":"SUMIF(TMP!$B$2:$B$41,A21,TMP!$I$2:$I$41)","v":0},{"$f":"SUMIF('Otros Datos'!C$2:C$7,Tabla2[[#This Row],[NOMBRE DEP]],'Otros Datos'!B$2:B$7)","v":0},{"$f":"'Otros Datos'!J21","v":0},{"$f":"SUMIF('Otros Datos'!G$2:G$6,Tabla2[[#This Row],[NOMBRE DEP]],'Otros Datos'!F$2:F$6)","v":0},{"$f":"TMP_Departamentos!D21","v":0},null,{"$f":"TMP_Departamentos!E21","v":0},null,{"$f":"SUM(Tabla2[[#This Row],[H LECT]:[OTR ASIG]])","v":0},{"$f":"Tabla2[[#This Row],[TOTALES]]/HORAS_PROFESOR","v":0}]
["TOTAL",{"$f":"SUBTOTAL(109,[H LECT])","v":0},{"$f":"SUBTOTAL(109,[DIRECC])","v":0},{"$f":"SUBTOTAL(109,[JDEPRT])","v":0},{"$f":"SUBTOTAL(109,[OTROS])","v":0},{"$f":"SUBTOTAL(109,[TUTORÍAS])","v":0},{"$f":"SUBTOTAL(109,[DESDOB])","v":0},{"$f":"SUBTOTAL(109,[SIN REL])","v":0},{"$f":"SUBTOTAL(109,[OTR ASIG])","v":0},{"$f":"SUBTOTAL(109,[TOTALES])","v":0},{"$f":"SUBTOTAL(109,[Nº PROF])","v":0}]
[]
["Horas Prof.",21]

{"sheet":"Departamentos","index":3,"n_rows":9,"n_cols":7,"rows_kept":9,"cut":false,"hidden":false,"merged":[]}
["DEPARTAMENTO","(en blanco)"]
[]
[null,"Valores",null,null,null,"DIRECCIÓN",{"$f":"VLOOKUP($B$1,Tabla2[],3,FALSE)","v":{"$error":"#N/A"}}]
["CURSOS/ASIGNATURAS","SESIONES","GRUPOS","HORAS",null,"JEF. DEPARTAMENTO",{"$f":"VLOOKUP($B$1,Tabla2[],4,FALSE)","v":{"$error":"#N/A"}}]
["(en blanco)",null,null,null,null,"DESDOBLES",{"$f":"VLOOKUP($B$1,Tabla2[],7,FALSE)","v":{"$error":"#N/A"}}]
["(en blanco)",null,null,null,null,"OTRAS REDUCC.",{"$f":"VLOOKUP($B$1,Tabla2[],5,FALSE)","v":{"$error":"#N/A"}}]
["Total general",null,null,null,null,"OTRAS ASIGNAT.",{"$f":"VLOOKUP($B$1,Tabla2[],9,FALSE)","v":{"$error":"#N/A"}}]
[]
[null,null,null,null,null,"TOTAL DEPARTAM.",{"$f":"GETPIVOTDATA(\"HORAS\",$A$3)+SUM(G3:G7)","v":{"$error":"#N/A"}}]

{"sheet":"Acta Departamentos","index":4,"n_rows":49,"n_cols":12,"rows_kept":49,"cut":false,"hidden":false,"merged":[[15,5,15,6],[1,1,2,8]]}
[]
[null,"ACTA DE LA SESIÓN DE DEPARTAMENTO"]
[]
[]
["DEPARTAMENTO","(en blanco)"]
[]
[null,"Valores",null,null,null,"DIRECCIÓN",{"$f":"VLOOKUP($B$5,Tabla2[],3,FALSE)","v":{"$error":"#N/A"}}]
["CURSOS/ASIGNATURAS","SESIONES","GRUPOS","HORAS",null,"JEF. DEPARTAMENTO",{"$f":"VLOOKUP($B$5,Tabla2[],4,FALSE)","v":{"$error":"#N/A"}}]
["(en blanco)",null,null,null,null,"DESDOBLES",{"$f":"VLOOKUP($B$5,Tabla2[],7,FALSE)","v":{"$error":"#N/A"}}]
["(en blanco)",null,null,null,null,"OTRAS REDUCC.",{"$f":"VLOOKUP($B$5,Tabla2[],5,FALSE)","v":{"$error":"#N/A"}}]
["Total general",null,null,null,null,"OTRAS ASIGNAT.",{"$f":"VLOOKUP($B$5,Tabla2[],9,FALSE)","v":{"$error":"#N/A"}}]
[]
[null,null,null,null,null,"TOTAL DEPARTAM.",{"$f":"GETPIVOTDATA(\"HORAS\",$A$7)+SUM(G7:G11)","v":{"$error":"#N/A"}}]
[]
[]
[null,null,null,null,null,"Nombre del Profesor",null,"Cargo","Asignatura","Nivel","nº de grupos","Total horas"]
[]
[]
[]
[]
[]
[]
[]
[]
[]
[]
[]
[]
[]
[]
[]
[]
[]
[]
[]
[]
[]
[]
[]
[]
[]
[]
[]
[]
[]
[]
[]
[]
[null,null,null,null,null,"NOTAS:"]

{"sheet":"TMP","index":5,"n_rows":41,"n_cols":16,"rows_kept":41,"cut":false,"hidden":true,"merged":[]}
["Asignatura","Departamento","NH_1ESO","NH_2ESO","NH_3ESO","NH_4ESO","NH_1BACH","NH_2BACH","NH_Totales","NG_1ESO","NG_2ESO","NG_3ESO","NG_4ESO","NG_1BACH","NG_2BACH","NG_Totales"]
[{"$f":"Datos!A3","v":"Biología"},{"$f":"Datos!B3","v":0},{"$f":"Datos!F3","v":0},{"$f":"Datos!J3","v":0},{"$f":"Datos!N3","v":0},{"$f":"Datos!R3","v":0},{"$f":"Datos!V3","v":0},{"$f":"Datos!Z3","v":0},{"$f":"SUM(C2:H2)","v":0},{"$f":"IF(Datos!D3<>\"N\",Datos!E3,Datos!F$1)","v":0},{"$f":"IF(Datos!H3<>\"N\",Datos!I3,Datos!J$1)","v":0},{"$f":"IF(Datos!L3<>\"N\",Datos!K3,Datos!N$1)","v":0},{"$f":"IF(Datos!P3<>\"N\",Datos!O3,Datos!R$1)","v":0},{"$f":"IF(Datos!T3<>\"N\",Datos!S3,Datos!V$1)","v":0},{"$f":"IF(Datos!X3<>\"N\",Datos!W3,Datos!Z$1)","v":0},{"$f":"SUM(J2:O2)","v":0}]
[{"$f":"Datos!A4","v":"Dibujo"},{"$f":"Datos!B4","v":0},{"$f":"Datos!F4","v":0},{"$f":"Datos!J4","v":0},{"$f":"Datos!N4","v":0},{"$f":"Datos!R4","v":0},{"$f":"Datos!V4","v":0},{"$f":"Datos!Z4","v":0},{"$f":"SUM(C3:H3)","v":0},{"$f":"IF(Datos!D4<>\"N\",Datos!E4,Datos!F$1)","v":0},{"$f":"IF(Datos!H4<>\"N\",Datos!I4,Datos!J$1)","v":0},{"$f":"IF(Datos!L4<>\"N\",Datos!K4,Datos!N$1)","v":0},{"$f":"IF(Datos!P4<>\"N\",Datos!O4,Datos!R$1)","v":0},{"$f":"IF(Datos!T4<>\"N\",Datos!S4,Datos!V$1)","v":0},{"$f":"IF(Datos!X4<>\"N\",Datos!W4,Datos!Z$1)","v":0},{"$f":"SUM(J3:O3)","v":0}]
[{"$f":"Datos!A5","v":"Ed Fisica"},{"$f":"Datos!B5","v":0},{"$f":"Datos!F5","v":0},{"$f":"Datos!J5","v":0},{"$f":"Datos!N5","v":0},{"$f":"Datos!R5","v":0},{"$f":"Datos!V5","v":0},{"$f":"Datos!Z5","v":0},0,{"$f":"IF(Datos!D5<>\"N\",Datos!E5,Datos!F$1)","v":0},{"$f":"IF(Datos!H5<>\"N\",Datos!I5,Datos!J$1)","v":0},{"$f":"IF(Datos!L5<>\"N\",Datos!K5,Datos!N$1)","v":0},{"$f":"IF(Datos!P5<>\"N\",Datos!O5,Datos!R$1)","v":0},{"$f":"IF(Datos!T5<>\"N\",Datos!S5,Datos!V$1)","v":0},{"$f":"IF(Datos!X5<>\"N\",Datos!W5,Datos!Z$1)","v":0},0]
[{"$f":"Datos!A6","v":"Ética"},{"$f":"Datos!B6","v":0},{"$f":"Datos!F6","v":0},{"$f":"Datos!J6","v":0},{"$f":"Datos!N6","v":0},{"$f":"Datos!R6","v":0},{"$f":"Datos!V6","v":0},{"$f":"Datos!Z6","v":0},0,{"$f":"IF(Datos!D6<>\"N\",Datos!E6,Datos!F$1)","v":0},{"$f":"IF(Datos!H6<>\"N\",Datos!I6,Datos!J$1)","v":0},{"$f":"IF(Datos!L6<>\"N\",Datos!K6,Datos!N$1)","v":0},{"$f":"IF(Datos!P6<>\"N\",Datos!O6,Datos!R$1)","v":0},{"$f":"IF(Datos!T6<>\"N\",Datos!S6,Datos!V$1)","v":0},{"$f":"IF(Datos!X6<>\"N\",Datos!W6,Datos!Z$1)","v":0},0]
[{"$f":"Datos!A7","v":"Física y Quím"},{"$f":"Datos!B7","v":0},{"$f":"Datos!F7","v":0},{"$f":"Datos!J7","v":0},{"$f":"Datos!N7","v":0},{"$f":"Datos!R7","v":0},{"$f":"Datos!V7","v":0},{"$f":"Datos!Z7","v":0},0,{"$f":"IF(Datos!D7<>\"N\",Datos!E7,Datos!F$1)","v":0},{"$f":"IF(Datos!H7<>\"N\",Datos!I7,Datos!J$1)","v":0},{"$f":"IF(Datos!L7<>\"N\",Datos!K7,Datos!N$1)","v":0},{"$f":"IF(Datos!P7<>\"N\",Datos!O7,Datos!R$1)","v":0},{"$f":"IF(Datos!T7<>\"N\",Datos!S7,Datos!V$1)","v":0},{"$f":"IF(Datos!X7<>\"N\",Datos!W7,Datos!Z$1)","v":0},0]
[{"$f":"Datos!A8","v":"Francés"},{"$f":"Datos!B8","v":0},{"$f":"Datos!F8","v":0},{"$f":"Datos!J8","v":0},{"$f":"Datos!N8","v":0},{"$f":"Datos!R8","v":0},{"$f":"Datos!V8","v":0},{"$f":"Datos!Z8","v":0},0,{"$f":"IF(Datos!D8<>\"N\",Datos!E8,Datos!F$1)","v":0},{"$f":"IF(Datos!H8<>\"N\",Datos!I8,Datos!J$1)","v":0},{"$f":"IF(Datos!L8<>\"N\",Datos!K8,Datos!N$1)","v":0},{"$f":"IF(Datos!P8<>\"N\",Datos!O8,Datos!R$1)","v":0},{"$f":"IF(Datos!T8<>\"N\",Datos!S8,Datos!V$1)","v":0},{"$f":"IF(Datos!X8<>\"N\",Datos!W8,Datos!Z$1)","v":0},0]
[{"$f":"Datos!A9","v":"Geografía"},{"$f":"Datos!B9","v":0},{"$f":"Datos!F9","v":0},{"$f":"Datos!J9","v":0},{"$f":"Datos!N9","v":0},{"$f":"Datos!R9","v":0},{"$f":"Datos!V9","v":0},{"$f":"Datos!Z9","v":0},0,{"$f":"IF(Datos!D9<>\"N\",Datos!E9,Datos!F$1)","v":0},{"$f":"IF(Datos!H9<>\"N\",Datos!I9,Datos!J$1)","v":0},{"$f":"IF(Datos!L9<>\"N\",Datos!K9,Datos!N$1)","v":0},{"$f":"IF(Datos!P9<>\"N\",Datos!O9,Datos!R$1)","v":0},{"$f":"IF(Datos!T9<>\"N\",Datos!S9,Datos!V$1)","v":0},{"$f":"IF(Datos!X9<>\"N\",Datos!W9,Datos!Z$1)","v":0},0]
[{"$f":"Datos!A10","v":"Informática"},{"$f":"Datos!B10","v":0},{"$f":"Datos!F10","v":0},{"$f":"Datos!J10","v":0},{"$f":"Datos!N10","v":0},{"$f":"Datos!R10","v":0},{"$f":"Datos!V10","v":0},{"$f":"Datos!Z10","v":0},0,{"$f":"IF(Datos!D10<>\"N\",Datos!E10,Datos!F$1)","v":0},{"$f":"IF(Datos!H10<>\"N\",Datos!I10,Datos!J$1)","v":0},{"$f":"IF(Datos!L10<>\"N\",Datos!K10,Datos!N$1)","v":0},{"$f":"IF(Datos!P10<>\"N\",Datos!O10,Datos!R$1)","v":0},{"$f":"IF(Datos!T10<>\"N\",Datos!S10,Datos!V$1)","v":0},{"$f":"IF(Datos!X10<>\"N\",Datos!W10,Datos!Z$1)","v":0},0]
[{"$f":"Datos!A11","v":"Inglés"},{"$f":"Datos!B11","v":0},{"$f":"Datos!F11","v":0},{"$f":"Datos!J11","v":0},{"$f":"Datos!N11","v":0},{"$f":"Datos!R11","v":0},{"$f":"Datos!V11","v":0},{"$f":"Datos!Z11","v":0},0,{"$f":"IF(Datos!D11<>\"N\",Datos!E11,Datos!F$1)","v":0},{"$f":"IF(Datos!H11<>\"N\",Datos!I11,Datos!J$1)","v":0},{"$f":"IF(Datos!L11<>\"N\",Datos!K11,Datos!N$1)","v":0},{"$f":"IF(Datos!P11<>\"N\",Datos!O11,Datos!R$1)","v":0},{"$f":"IF(Datos!T11<>\"N\",Datos!S11,Datos!V$1)","v":0},{"$f":"IF(Datos!X11<>\"N\",Datos!W11,Datos!Z$1)","v":0},0]
[{"$f":"Datos!A12","v":"Lengua Cast"},{"$f":"Datos!B12","v":0},{"$f":"Datos!F12","v":0},{"$f":"Datos!J12","v":0},{"$f":"Datos!N12","v":0},{"$f":"Datos!R12","v":0},{"$f":"Datos!V12","v":0},{"$f":"Datos!Z12","v":0},0,{"$f":"IF(Datos!D12<>\"N\",Datos!E12,Datos!F$1)","v":0},{"$f":"IF(Datos!H12<>\"N\",Datos!I12,Datos!J$1)","v":0},{"$f":"IF(Datos!L12<>\"N\",Datos!K12,Datos!N$1)","v":0},{"$f":"IF(Datos!P12<>\"N\",Datos!O12,Datos!R$1)","v":0},{"$f":"IF(Datos!T12<>\"N\",Datos!S12,Datos!V$1)","v":0},{"$f":"IF(Datos!X12<>\"N\",Datos!W12,Datos!Z$1)","v":0},0]
[{"$f":"Datos!A13","v":"Matemáticas"},{"$f":"Datos!B13","v":0},{"$f":"Datos!F13","v":0},{"$f":"Datos!J13","v":0},{"$f":"Datos!N13","v":0},{"$f":"Datos!R13","v":0},{"$f":"Datos!V13","v":0},{"$f":"Datos!Z13","v":0},0,{"$f":"IF(Datos!D13<>\"N\",Datos!E13,Datos!F$1)","v":0},{"$f":"IF(Datos!H13<>\"N\",Datos!I13,Datos!J$1)","v":0},{"$f":"IF(Datos!L13<>\"N\",Datos!K13,Datos!N$1)","v":0},{"$f":"IF(Datos!P13<>\"N\",Datos!O13,Datos!R$1)","v":0},{"$f":"IF(Datos!T13<>\"N\",Datos!S13,Datos!V$1)","v":0},{"$f":"IF(Datos!X13<>\"N\",Datos!W13,Datos!Z$1)","v":0},0]
[{"$f":"Datos!A14","v":"Música"},{"$f":"Datos!B14","v":0},{"$f":"Datos!F14","v":0},{"$f":"Datos!J14","v":0},{"$f":"Datos!N14","v":0},{"$f":"Datos!R14","v":0},{"$f":"Datos!V14","v":0},{"$f":"Datos!Z14","v":0},0,{"$f":"IF(Datos!D14<>\"N\",Datos!E14,Datos!F$1)","v":0},{"$f":"IF(Datos!H14<>\"N\",Datos!I14,Datos!J$1)","v":0},{"$f":"IF(Datos!L14<>\"N\",Datos!K14,Datos!N$1)","v":0},{"$f":"IF(Datos!P14<>\"N\",Datos!O14,Datos!R$1)","v":0},{"$f":"IF(Datos!T14<>\"N\",Datos!S14,Datos!V$1)","v":0},{"$f":"IF(Datos!X14<>\"N\",Datos!W14,Datos!Z$1)","v":0},0]
[{"$f":"Datos!A15","v":"Tecnología"},{"$f":"Datos!B15","v":0},{"$f":"Datos!F15","v":0},{"$f":"Datos!J15","v":0},{"$f":"Datos!N15","v":0},{"$f":"Datos!R15","v":0},{"$f":"Datos!V15","v":0},{"$f":"Datos!Z15","v":0},0,{"$f":"IF(Datos!D15<>\"N\",Datos!E15,Datos!F$1)","v":0},{"$f":"IF(Datos!H15<>\"N\",Datos!I15,Datos!J$1)","v":0},{"$f":"IF(Datos!L15<>\"N\",Datos!K15,Datos!N$1)","v":0},{"$f":"IF(Datos!P15<>\"N\",Datos!O15,Datos!R$1)","v":0},{"$f":"IF(Datos!T15<>\"N\",Datos!S15,Datos!V$1)","v":0},{"$f":"IF(Datos!X15<>\"N\",Datos!W15,Datos!Z$1)","v":0},0]
[{"$f":"Datos!A16","v":"Taller Mat"},{"$f":"Datos!B16","v":0},{"$f":"Datos!F16","v":0},{"$f":"Datos!J16","v":0},{"$f":"Datos!N16","v":0},{"$f":"Datos!R16","v":0},{"$f":"Datos!V16","v":0},{"$f":"Datos!Z16","v":0},0,{"$f":"IF(Datos!D16<>\"N\",Datos!E16,Datos!F$1)","v":0},{"$f":"IF(Datos!H16<>\"N\",Datos!I16,Datos!J$1)","v":0},{"$f":"IF(Datos!L16<>\"N\",Datos!K16,Datos!N$1)","v":0},{"$f":"IF(Datos!P16<>\"N\",Datos!O16,Datos!R$1)","v":0},{"$f":"IF(Datos!T16<>\"N\",Datos!S16,Datos!V$1)","v":0},{"$f":"IF(Datos!X16<>\"N\",Datos!W16,Datos!Z$1)","v":0},0]
[{"$f":"Datos!A17","v":"taller Leng"},{"$f":"Datos!B17","v":0},{"$f":"Datos!F17","v":0},{"$f":"Datos!J17","v":0},{"$f":"Datos!N17","v":0},{"$f":"Datos!R17","v":0},{"$f":"Datos!V17","v":0},{"$f":"Datos!Z17","v":0},0,{"$f":"IF(Datos!D17<>\"N\",Datos!E17,Datos!F$1)","v":0},{"$f":"IF(Datos!H17<>\"N\",Datos!I17,Datos!J$1)","v":0},{"$f":"IF(Datos!L17<>\"N\",Datos!K17,Datos!N$1)","v":0},{"$f":"IF(Datos!P17<>\"N\",Datos!O17,Datos!R$1)","v":0},{"$f":"IF(Datos!T17<>\"N\",Datos!S17,Datos!V$1)","v":0},{"$f":"IF(Datos!X17<>\"N\",Datos!W17,Datos!Z$1)","v":0},0]
[{"$f":"Datos!A18","v":"Asign 1"},{"$f":"Datos!B18","v":0},{"$f":"Datos!F18","v":0},{"$f":"Datos!J18","v":0},{"$f":"Datos!N18","v":0},{"$f":"Datos!R18","v":0},{"$f":"Datos!V18","v":0},{"$f":"Datos!Z18","v":0},0,{"$f":"IF(Datos!D18<>\"N\",Datos!E18,Datos!F$1)","v":0},{"$f":"IF(Datos!H18<>\"N\",Datos!I18,Datos!J$1)","v":0},{"$f":"IF(Datos!L18<>\"N\",Datos!K18,Datos!N$1)","v":0},{"$f":"IF(Datos!P18<>\"N\",Datos!O18,Datos!R$1)","v":0},{"$f":"IF(Datos!T18<>\"N\",Datos!S18,Datos!V$1)","v":0},{"$f":"IF(Datos!X18<>\"N\",Datos!W18,Datos!Z$1)","v":0},0]
[{"$f":"Datos!A19","v":"Asign 2"},{"$f":"Datos!B19","v":0},{"$f":"Datos!F19","v":0},{"$f":"Datos!J19","v":0},{"$f":"Datos!N19","v":0},{"$f":"Datos!R19","v":0},{"$f":"Datos!V19","v":0},{"$f":"Datos!Z19","v":0},0,{"$f":"IF(Datos!D19<>\"N\",Datos!E19,Datos!F$1)","v":0},{"$f":"IF(Datos!H19<>\"N\",Datos!I19,Datos!J$1)","v":0},{"$f":"IF(Datos!L19<>\"N\",Datos!K19,Datos!N$1)","v":0},{"$f":"IF(Datos!P19<>\"N\",Datos!O19,Datos!R$1)","v":0},{"$f":"IF(Datos!T19<>\"N\",Datos!S19,Datos!V$1)","v":0},{"$f":"IF(Datos!X19<>\"N\",Datos!W19,Datos!Z$1)","v":0},0]
[{"$f":"Datos!A20","v":"Asign 3"},{"$f":"Datos!B20","v":0},{"$f":"Datos!F20","v":0},{"$f":"Datos!J20","v":0},{"$f":"Datos!N20","v":0},{"$f":"Datos!R20","v":0},{"$f":"Datos!V20","v":0},{"$f":"Datos!Z20","v":0},0,{"$f":"IF(Datos!D20<>\"N\",Datos!E20,Datos!F$1)","v":0},{"$f":"IF(Datos!H20<>\"N\",Datos!I20,Datos!J$1)","v":0},{"$f":"IF(Datos!L20<>\"N\",Datos!K20,Datos!N$1)","v":0},{"$f":"IF(Datos!P20<>\"N\",Datos!O20,Datos!R$1)","v":0},{"$f":"IF(Datos!T20<>\"N\",Datos!S20,Datos!V$1)","v":0},{"$f":"IF(Datos!X20<>\"N\",Datos!W20,Datos!Z$1)","v":0},0]
[{"$f":"Datos!A21","v":"Asign 4"},{"$f":"Datos!B21","v":0},{"$f":"Datos!F21","v":0},{"$f":"Datos!J21","v":0},{"$f":"Datos!N21","v":0},{"$f":"Datos!R21","v":0},{"$f":"Datos!V21","v":0},{"$f":"Datos!Z21","v":0},0,{"$f":"IF(Datos!D21<>\"N\",Datos!E21,Datos!F$1)","v":0},{"$f":"IF(Datos!H21<>\"N\",Datos!I21,Datos!J$1)","v":0},{"$f":"IF(Datos!L21<>\"N\",Datos!K21,Datos!N$1)","v":0},{"$f":"IF(Datos!P21<>\"N\",Datos!O21,Datos!R$1)","v":0},{"$f":"IF(Datos!T21<>\"N\",Datos!S21,Datos!V$1)","v":0},{"$f":"IF(Datos!X21<>\"N\",Datos!W21,Datos!Z$1)","v":0},0]
[{"$f":"Datos!A22","v":"Asign 5"},{"$f":"Datos!B22","v":0},{"$f":"Datos!F22","v":0},{"$f":"Datos!J22","v":0},{"$f":"Datos!N22","v":0},{"$f":"Datos!R22","v":0},{"$f":"Datos!V22","v":0},{"$f":"Datos!Z22","v":0},0,{"$f":"IF(Datos!D22<>\"N\",Datos!E22,Datos!F$1)","v":0},{"$f":"IF(Datos!H22<>\"N\",Datos!I22,Datos!J$1)","v":0},{"$f":"IF(Datos!L22<>\"N\",Datos!K22,Datos!N$1)","v":0},{"$f":"IF(Datos!P22<>\"N\",Datos!O22,Datos!R$1)","v":0},{"$f":"IF(Datos!T22<>\"N\",Datos!S22,Datos!V$1)","v":0},{"$f":"IF(Datos!X22<>\"N\",Datos!W22,Datos!Z$1)","v":0},0]
[{"$f":"Datos!A23","v":"Hist Relig"},{"$f":"Datos!B23","v":0},{"$f":"Datos!F23","v":0},{"$f":"Datos!J23","v":0},{"$f":"Datos!N23","v":0},{"$f":"Datos!R23","v":0},{"$f":"Datos!V23","v":0},{"$f":"Datos!Z23","v":0},0,{"$f":"IF(Datos!D23<>\"N\",Datos!E23,Datos!F$1)","v":0},{"$f":"IF(Datos!H23<>\"N\",Datos!I23,Datos!J$1)","v":0},{"$f":"IF(Datos!L23<>\"N\",Datos!K23,Datos!N$1)","v":0},{"$f":"IF(Datos!P23<>\"N\",Datos!O23,Datos!R$1)","v":0},{"$f":"IF(Datos!T23<>\"N\",Datos!S23,Datos!V$1)","v":0},{"$f":"IF(Datos!X23<>\"N\",Datos!W23,Datos!Z$1)","v":0},0]
[{"$f":"Datos!A24","v":"Ámbito CT"},{"$f":"Datos!B24","v":0},{"$f":"Datos!F24","v":0},{"$f":"Datos!J24","v":0},{"$f":"Datos!N24","v":0},{"$f":"Datos!R24","v":0},{"$f":"Datos!V24","v":0},{"$f":"Datos!Z24","v":0},0,{"$f":"IF(Datos!D24<>\"N\",Datos!E24,Datos!F$1)","v":0},{"$f":"IF(Datos!H24<>\"N\",Datos!I24,Datos!J$1)","v":0},{"$f":"IF(Datos!L24<>\"N\",Datos!K24,Datos!N$1)","v":0},{"$f":"IF(Datos!P24<>\"N\",Datos!O24,Datos!R$1)","v":0},{"$f":"IF(Datos!T24<>\"N\",Datos!S24,Datos!V$1)","v":0},{"$f":"IF(Datos!X24<>\"N\",Datos!W24,Datos!Z$1)","v":0},0]
[{"$f":"Datos!A25","v":"Ámbito SL"},{"$f":"Datos!B25","v":0},{"$f":"Datos!F25","v":0},{"$f":"Datos!J25","v":0},{"$f":"Datos!N25","v":0},{"$f":"Datos!R25","v":0},{"$f":"Datos!V25","v":0},{"$f":"Datos!Z25","v":0},0,{"$f":"IF(Datos!D25<>\"N\",Datos!E25,Datos!F$1)","v":0},{"$f":"IF(Datos!H25<>\"N\",Datos!I25,Datos!J$1)","v":0},{"$f":"IF(Datos!L25<>\"N\",Datos!K25,Datos!N$1)","v":0},{"$f":"IF(Datos!P25<>\"N\",Datos!O25,Datos!R$1)","v":0},{"$f":"IF(Datos!T25<>\"N\",Datos!S25,Datos!V$1)","v":0},{"$f":"IF(Datos!X25<>\"N\",Datos!W25,Datos!Z$1)","v":0},0]
[{"$f":"Datos!A26","v":"Economía"},{"$f":"Datos!B26","v":0},{"$f":"Datos!F26","v":0},{"$f":"Datos!J26","v":0},{"$f":"Datos!N26","v":0},{"$f":"Datos!R26","v":0},{"$f":"Datos!V26","v":0},{"$f":"Datos!Z26","v":0},0,{"$f":"IF(Datos!D26<>\"N\",Datos!E26,Datos!F$1)","v":0},{"$f":"IF(Datos!H26<>\"N\",Datos!I26,Datos!J$1)","v":0},{"$f":"IF(Datos!L26<>\"N\",Datos!K26,Datos!N$1)","v":0},{"$f":"IF(Datos!P26<>\"N\",Datos!O26,Datos!R$1)","v":0},{"$f":"IF(Datos!T26<>\"N\",Datos!S26,Datos!V$1)","v":0},{"$f":"IF(Datos!X26<>\"N\",Datos!W26,Datos!Z$1)","v":0},0]
[{"$f":"Datos!A27","v":"Ed Ciudadanía"},{"$f":"Datos!B27","v":0},{"$f":"Datos!F27","v":0},{"$f":"Datos!J27","v":0},{"$f":"Datos!N27","v":0},{"$f":"Datos!R27","v":0},{"$f":"Datos!V27","v":0},{"$f":"Datos!Z27","v":0},0,{"$f":"IF(Datos!D27<>\"N\",Datos!E27,Datos!F$1)","v":0},{"$f":"IF(Datos!H27<>\"N\",Datos!I27,Datos!J$1)","v":0},{"$f":"IF(Datos!L27<>\"N\",Datos!K27,Datos!N$1)","v":0},{"$f":"IF(Datos!P27<>\"N\",Datos!O27,Datos!R$1)","v":0},{"$f":"IF(Datos!T27<>\"N\",Datos!S27,Datos!V$1)","v":0},{"$f":"IF(Datos!X27<>\"N\",Datos!W27,Datos!Z$1)","v":0},0]
[{"$f":"Datos!A28","v":"Electrotecnia"},{"$f":"Datos!B28","v":0},{"$f":"Datos!F28","v":0},{"$f":"Datos!J28","v":0},{"$f":"Datos!N28","v":0},{"$f":"Datos!R28","v":0},{"$f":"Datos!V28","v":0},{"$f":"Datos!Z28","v":0},0,{"$f":"IF(Datos!D28<>\"N\",Datos!E28,Datos!F$1)","v":0},{"$f":"IF(Datos!H28<>\"N\",Datos!I28,Datos!J$1)","v":0},{"$f":"IF(Datos!L28<>\"N\",Datos!K28,Datos!N$1)","v":0},{"$f":"IF(Datos!P28<>\"N\",Datos!O28,Datos!R$1)","v":0},{"$f":"IF(Datos!T28<>\"N\",Datos!S28,Datos!V$1)","v":0},{"$f":"IF(Datos!X28<>\"N\",Datos!W28,Datos!Z$1)","v":0},0]
[{"$f":"Datos!A29","v":"Filosofía"},{"$f":"Datos!B29","v":0},{"$f":"Datos!F29","v":0},{"$f":"Datos!J29","v":0},{"$f":"Datos!N29","v":0},{"$f":"Datos!R29","v":0},{"$f":"Datos!V29","v":0},{"$f":"Datos!Z29","v":0},0,{"$f":"IF(Datos!D29<>\"N\",Datos!E29,Datos!F$1)","v":0},{"$f":"IF(Datos!H29<>\"N\",Datos!I29,Datos!J$1)","v":0},{"$f":"IF(Datos!L29<>\"N\",Datos!K29,Datos!N$1)","v":0},{"$f":"IF(Datos!P29<>\"N\",Datos!O29,Datos!R$1)","v":0},{"$f":"IF(Datos!T29<>\"N\",Datos!S29,Datos!V$1)","v":0},{"$f":"IF(Datos!X29<>\"N\",Datos!W29,Datos!Z$1)","v":0},0]
[{"$f":"Datos!A30","v":"Física "},{"$f":"Datos!B30","v":0},{"$f":"Datos!F30","v":0},{"$f":"Datos!J30","v":0},{"$f":"Datos!N30","v":0},{"$f":"Datos!R30","v":0},{"$f":"Datos!V30","v":0},{"$f":"Datos!Z30","v":0},0,{"$f":"IF(Datos!D30<>\"N\",Datos!E30,Datos!F$1)","v":0},{"$f":"IF(Datos!H30<>\"N\",Datos!I30,Datos!J$1)","v":0},{"$f":"IF(Datos!L30<>\"N\",Datos!K30,Datos!N$1)","v":0},{"$f":"IF(Datos!P30<>\"N\",Datos!O30,Datos!R$1)","v":0},{"$f":"IF(Datos!T30<>\"N\",Datos!S30,Datos!V$1)","v":0},{"$f":"IF(Datos!X30<>\"N\",Datos!W30,Datos!Z$1)","v":0},0]
[{"$f":"Datos!A31","v":"FOL"},{"$f":"Datos!B31","v":0},{"$f":"Datos!F31","v":0},{"$f":"Datos!J31","v":0},{"$f":"Datos!N31","v":0},{"$f":"Datos!R31","v":0},{"$f":"Datos!V31","v":0},{"$f":"Datos!Z31","v":0},0,{"$f":"IF(Datos!D31<>\"N\",Datos!E31,Datos!F$1)","v":0},{"$f":"IF(Datos!H31<>\"N\",Datos!I31,Datos!J$1)","v":0},{"$f":"IF(Datos!L31<>\"N\",Datos!K31,Datos!N$1)","v":0},{"$f":"IF(Datos!P31<>\"N\",Datos!O31,Datos!R$1)","v":0},{"$f":"IF(Datos!T31<>\"N\",Datos!S31,Datos!V$1)","v":0},{"$f":"IF(Datos!X31<>\"N\",Datos!W31,Datos!Z$1)","v":0},0]
[{"$f":"Datos!A32","v":"Fundamentos"},{"$f":"Datos!B32","v":0},{"$f":"Datos!F32","v":0},{"$f":"Datos!J32","v":0},{"$f":"Datos!N32","v":0},{"$f":"Datos!R32","v":0},{"$f":"Datos!V32","v":0},{"$f":"Datos!Z32","v":0},0,{"$f":"IF(Datos!D32<>\"N\",Datos!E32,Datos!F$1)","v":0},{"$f":"IF(Datos!H32<>\"N\",Datos!I32,Datos!J$1)","v":0},{"$f":"IF(Datos!L32<>\"N\",Datos!K32,Datos!N$1)","v":0},{"$f":"IF(Datos!P32<>\"N\",Datos!O32,Datos!R$1)","v":0},{"$f":"IF(Datos!T32<>\"N\",Datos!S32,Datos!V$1)","v":0},{"$f":"IF(Datos!X32<>\"N\",Datos!W32,Datos!Z$1)","v":0},0]
[{"$f":"Datos!A33","v":"Geología"},{"$f":"Datos!B33","v":0},{"$f":"Datos!F33","v":0},{"$f":"Datos!J33","v":0},{"$f":"Datos!N33","v":0},{"$f":"Datos!R33","v":0},{"$f":"Datos!V33","v":0},{"$f":"Datos!Z33","v":0},0,{"$f":"IF(Datos!D33<>\"N\",Datos!E33,Datos!F$1)","v":0},{"$f":"IF(Datos!H33<>\"N\",Datos!I33,Datos!J$1)","v":0},{"$f":"IF(Datos!L33<>\"N\",Datos!K33,Datos!N$1)","v":0},{"$f":"IF(Datos!P33<>\"N\",Datos!O33,Datos!R$1)","v":0},{"$f":"IF(Datos!T33<>\"N\",Datos!S33,Datos!V$1)","v":0},{"$f":"IF(Datos!X33<>\"N\",Datos!W33,Datos!Z$1)","v":0},0]
[{"$f":"Datos!A34","v":"Griego"},{"$f":"Datos!B34","v":0},{"$f":"Datos!F34","v":0},{"$f":"Datos!J34","v":0},{"$f":"Datos!N34","v":0},{"$f":"Datos!R34","v":0},{"$f":"Datos!V34","v":0},{"$f":"Datos!Z34","v":0},0,{"$f":"IF(Datos!D34<>\"N\",Datos!E34,Datos!F$1)","v":0},{"$f":"IF(Datos!H34<>\"N\",Datos!I34,Datos!J$1)","v":0},{"$f":"IF(Datos!L34<>\"N\",Datos!K34,Datos!N$1)","v":0},{"$f":"IF(Datos!P34<>\"N\",Datos!O34,Datos!R$1)","v":0},{"$f":"IF(Datos!T34<>\"N\",Datos!S34,Datos!V$1)","v":0},{"$f":"IF(Datos!X34<>\"N\",Datos!W34,Datos!Z$1)","v":0},0]
[{"$f":"Datos!A35","v":"Historia"},{"$f":"Datos!B35","v":0},{"$f":"Datos!F35","v":0},{"$f":"Datos!J35","v":0},{"$f":"Datos!N35","v":0},{"$f":"Datos!R35","v":0},{"$f":"Datos!V35","v":0},{"$f":"Datos!Z35","v":0},0,{"$f":"IF(Datos!D35<>\"N\",Datos!E35,Datos!F$1)","v":0},{"$f":"IF(Datos!H35<>\"N\",Datos!I35,Datos!J$1)","v":0},{"$f":"IF(Datos!L35<>\"N\",Datos!K35,Datos!N$1)","v":0},{"$f":"IF(Datos!P35<>\"N\",Datos!O35,Datos!R$1)","v":0},{"$f":"IF(Datos!T35<>\"N\",Datos!S35,Datos!V$1)","v":0},{"$f":"IF(Datos!X35<>\"N\",Datos!W35,Datos!Z$1)","v":0},0]
[{"$f":"Datos!A36","v":"Historia Arte"},{"$f":"Datos!B36","v":0},{"$f":"Datos!F36","v":0},{"$f":"Datos!J36","v":0},{"$f":"Datos!N36","v":0},{"$f":"Datos!R36","v":0},{"$f":"Datos!V36","v":0},{"$f":"Datos!Z36","v":0},0,{"$f":"IF(Datos!D36<>\"N\",Datos!E36,Datos!F$1)","v":0},{"$f":"IF(Datos!H36<>\"N\",Datos!I36,Datos!J$1)","v":0},{"$f":"IF(Datos!L36<>\"N\",Datos!K36,Datos!N$1)","v":0},{"$f":"IF(Datos!P36<>\"N\",Datos!O36,Datos!R$1)","v":0},{"$f":"IF(Datos!T36<>\"N\",Datos!S36,Datos!V$1)","v":0},{"$f":"IF(Datos!X36<>\"N\",Datos!W36,Datos!Z$1)","v":0},0]
[{"$f":"Datos!A37","v":"Inglés Profes"},{"$f":"Datos!B37","v":0},{"$f":"Datos!F37","v":0},{"$f":"Datos!J37","v":0},{"$f":"Datos!N37","v":0},{"$f":"Datos!R37","v":0},{"$f":"Datos!V37","v":0},{"$f":"Datos!Z37","v":0},0,{"$f":"IF(Datos!D37<>\"N\",Datos!E37,Datos!F$1)","v":0},{"$f":"IF(Datos!H37<>\"N\",Datos!I37,Datos!J$1)","v":0},{"$f":"IF(Datos!L37<>\"N\",Datos!K37,Datos!N$1)","v":0},{"$f":"IF(Datos!P37<>\"N\",Datos!O37,Datos!R$1)","v":0},{"$f":"IF(Datos!T37<>\"N\",Datos!S37,Datos!V$1)","v":0},{"$f":"IF(Datos!X37<>\"N\",Datos!W37,Datos!Z$1)","v":0},0]
[{"$f":"Datos!A38","v":"Latín"},{"$f":"Datos!B38","v":0},{"$f":"Datos!F38","v":0},{"$f":"Datos!J38","v":0},{"$f":"Datos!N38","v":0},{"$f":"Datos!R38","v":0},{"$f":"Datos!V38","v":0},{"$f":"Datos!Z38","v":0},0,{"$f":"IF(Datos!D38<>\"N\",Datos!E38,Datos!F$1)","v":0},{"$f":"IF(Datos!H38<>\"N\",Datos!I38,Datos!J$1)","v":0},{"$f":"IF(Datos!L38<>\"N\",Datos!K38,Datos!N$1)","v":0},{"$f":"IF(Datos!P38<>\"N\",Datos!O38,Datos!R$1)","v":0},{"$f":"IF(Datos!T38<>\"N\",Datos!S38,Datos!V$1)","v":0},{"$f":"IF(Datos!X38<>\"N\",Datos!W38,Datos!Z$1)","v":0},0]
[{"$f":"Datos!A39","v":"Literatura"},{"$f":"Datos!B39","v":0},{"$f":"Datos!F39","v":0},{"$f":"Datos!J39","v":0},{"$f":"Datos!N39","v":0},{"$f":"Datos!R39","v":0},{"$f":"Datos!V39","v":0},{"$f":"Datos!Z39","v":0},0,{"$f":"IF(Datos!D39<>\"N\",Datos!E39,Datos!F$1)","v":0},{"$f":"IF(Datos!H39<>\"N\",Datos!I39,Datos!J$1)","v":0},{"$f":"IF(Datos!L39<>\"N\",Datos!K39,Datos!N$1)","v":0},{"$f":"IF(Datos!P39<>\"N\",Datos!O39,Datos!R$1)","v":0},{"$f":"IF(Datos!T39<>\"N\",Datos!S39,Datos!V$1)","v":0},{"$f":"IF(Datos!X39<>\"N\",Datos!W39,Datos!Z$1)","v":0},0]
[{"$f":"Datos!A40","v":"Mecánica"},{"$f":"Datos!B40","v":0},{"$f":"Datos!F40","v":0},{"$f":"Datos!J40","v":0},{"$f":"Datos!N40","v":0},{"$f":"Datos!R40","v":0},{"$f":"Datos!V40","v":0},{"$f":"Datos!Z40","v":0},0,{"$f":"IF(Datos!D40<>\"N\",Datos!E40,Datos!F$1)","v":0},{"$f":"IF(Datos!H40<>\"N\",Datos!I40,Datos!J$1)","v":0},{"$f":"IF(Datos!L40<>\"N\",Datos!K40,Datos!N$1)","v":0},{"$f":"IF(Datos!P40<>\"N\",Datos!O40,Datos!R$1)","v":0},{"$f":"IF(Datos!T40<>\"N\",Datos!S40,Datos!V$1)","v":0},{"$f":"IF(Datos!X40<>\"N\",Datos!W40,Datos!Z$1)","v":0},0]
[{"$f":"Datos!A41","v":"Psicología"},{"$f":"Datos!B41","v":0},{"$f":"Datos!F41","v":0},{"$f":"Datos!J41","v":0},{"$f":"Datos!N41","v":0},{"$f":"Datos!R41","v":0},{"$f":"Datos!V41","v":0},{"$f":"Datos!Z41","v":0},0,{"$f":"IF(Datos!D41<>\"N\",Datos!E41,Datos!F$1)","v":0},{"$f":"IF(Datos!H41<>\"N\",Datos!I41,Datos!J$1)","v":0},{"$f":"IF(Datos!L41<>\"N\",Datos!K41,Datos!N$1)","v":0},{"$f":"IF(Datos!P41<>\"N\",Datos!O41,Datos!R$1)","v":0},{"$f":"IF(Datos!T41<>\"N\",Datos!S41,Datos!V$1)","v":0},{"$f":"IF(Datos!X41<>\"N\",Datos!W41,Datos!Z$1)","v":0},0]
[{"$f":"Datos!A42","v":"Química"},{"$f":"Datos!B42","v":0},{"$f":"Datos!F42","v":0},{"$f":"Datos!J42","v":0},{"$f":"Datos!N42","v":0},{"$f":"Datos!R42","v":0},{"$f":"Datos!V42","v":0},{"$f":"Datos!Z42","v":0},0,{"$f":"IF(Datos!D42<>\"N\",Datos!E42,Datos!F$1)","v":0},{"$f":"IF(Datos!H42<>\"N\",Datos!I42,Datos!J$1)","v":0},{"$f":"IF(Datos!L42<>\"N\",Datos!K42,Datos!N$1)","v":0},{"$f":"IF(Datos!P42<>\"N\",Datos!O42,Datos!R$1)","v":0},{"$f":"IF(Datos!T42<>\"N\",Datos!S42,Datos!V$1)","v":0},{"$f":"IF(Datos!X42<>\"N\",Datos!W42,Datos!Z$1)","v":0},0]

{"sheet":"TMP_Departamentos","index":6,"n_rows":21,"n_cols":21,"rows_kept":21,"cut":false,"hidden":true,"merged":[]}
["Departamento","Direcc","Jef. Dep","Tutorías","SREL","BORRADO","OTRAS","NH_1ESO","NH_2ESO","NH_3ESO","NH_4ESO","NH_1BACH","NH_2BACH","NH_Totales","NG_1ESO","NG_2ESO","NG_3ESO","NG_4ESO","NG_1BACH","NG_2BACH","NG_Totales"]
[{"$f":"'Otros Datos'!I2","v":"Biología"},{"$f":"Tabla2[[#This Row],[DIRECC]]","v":0},{"$f":"Tabla2[[#This Row],[JDEPRT]]","v":0},{"$f":"COUNTIF(CUPO!$R$3:AA$3,A2)*CUPO!$O$3+COUNTIF(CUPO!$R$4:AA$4,A2)*CUPO!$O$4+COUNTIF(CUPO!$R$5:AA$5,A2)*CUPO!$O$5+COUNTIF(CUPO!$R$6:AA$6,A2)*CUPO!$O$6+COUNTIF(CUPO!$R$7:AA$7,A2)*CUPO!$O$7+COUNTIF(CUPO!$R$8:AA$8,A2)*CUPO!$O$8+COUNTIF(CUPO!$R$9:AA$9,A2)*CUPO!$O$9+COUNTIF(CUPO!$R$10:AA$10,A2)*CUPO!$O$10","v":0},{"$f":"COUNTIF(CUPO!$R$14:$AA$14,A2)*CUPO!$O$14+COUNTIF(CUPO!$R$15:$AA$15,A2)*CUPO!$O$15+COUNTIF(CUPO!$R$16:$AA$16,A2)*CUPO!$O$16+COUNTIF(CUPO!$R$17:$AA$17,A2)*CUPO!$O$17+COUNTIF(CUPO!$R$18:$AA$18,A2)*CUPO!$O$18+COUNTIF(CUPO!$R$19:$AA$19,A2)*CUPO!$O$19","v":0},null,{"$f":"Tabla2[[#This Row],[OTR ASIG]]","v":0},{"$f":"SUMIF(TMP!$B$2:$B$41,$A2,TMP!C$2:C$41)","v":0},{"$f":"SUMIF(TMP!$B$2:$B$41,$A2,TMP!D$2:D$41)","v":0},{"$f":"SUMIF(TMP!$B$2:$B$41,$A2,TMP!E$2:E$41)","v":0},{"$f":"SUMIF(TMP!$B$2:$B$41,$A2,TMP!F$2:F$41)","v":0},{"$f":"SUMIF(TMP!$B$2:$B$41,$A2,TMP!G$2:G$41)","v":0},{"$f":"SUMIF(TMP!$B$2:$B$41,$A2,TMP!H$2:H$41)","v":0},{"$f":"SUMIF(TMP!$B$2:$B$41,$A2,TMP!I$2:I$41)","v":0},{"$f":"SUMIF(TMP!$B$2:$B$41,$A2,TMP!J$2:J$41)","v":0},{"$f":"SUMIF(TMP!$B$2:$B$41,$A2,TMP!K$2:K$41)","v":0},{"$f":"SUMIF(TMP!$B$2:$B$41,$A2,TMP!L$2:L$41)","v":0},{"$f":"SUMIF(TMP!$B$2:$B$41,$A2,TMP!M$2:M$41)","v":0},{"$f":"SUMIF(TMP!$B$2:$B$41,$A2,TMP!N$2:N$41)","v":0},{"$f":"SUMIF(TMP!$B$2:$B$41,$A2,TMP!O$2:O$41)","v":0},{"$f":"SUMIF(TMP!$B$2:$B$41,$A2,TMP!P$2:P$41)","v":0}]
[{"$f":"'Otros Datos'!I3","v":"Economía"},{"$f":"Tabla2[[#This Row],[DIRECC]]","v":0},{"$f":"Tabla2[[#This Row],[JDEPRT]]","v":0},{"$f":"COUNTIF(CUPO!$R$3:AA$3,A3)*CUPO!$O$3+COUNTIF(CUPO!$R$4:AA$4,A3)*CUPO!$O$4+COUNTIF(CUPO!$R$5:AA$5,A3)*CUPO!$O$5+COUNTIF(CUPO!$R$6:AA$6,A3)*CUPO!$O$6+COUNTIF(CUPO!$R$7:AA$7,A3)*CUPO!$O$7+COUNTIF(CUPO!$R$8:AA$8,A3)*CUPO!$O$8+COUNTIF(CUPO!$R$9:AA$9,A3)*CUPO!$O$9+COUNTIF(CUPO!$R$10:AA$10,A3)*CUPO!$O$10","v":0},{"$f":"COUNTIF(CUPO!$R$14:$AA$14,A3)*CUPO!$O$14+COUNTIF(CUPO!$R$15:$AA$15,A3)*CUPO!$O$15+COUNTIF(CUPO!$R$16:$AA$16,A3)*CUPO!$O$16+COUNTIF(CUPO!$R$17:$AA$17,A3)*CUPO!$O$17+COUNTIF(CUPO!$R$18:$AA$18,A3)*CUPO!$O$18+COUNTIF(CUPO!$R$19:$AA$19,A3)*CUPO!$O$19","v":0},null,{"$f":"Tabla2[[#This Row],[OTR ASIG]]","v":0},{"$f":"SUMIF(TMP!$B$2:$B$41,$A3,TMP!C$2:C$41)","v":0},{"$f":"SUMIF(TMP!$B$2:$B$41,$A3,TMP!D$2:D$41)","v":0},{"$f":"SUMIF(TMP!$B$2:$B$41,$A3,TMP!E$2:E$41)","v":0},{"$f":"SUMIF(TMP!$B$2:$B$41,$A3,TMP!F$2:F$41)","v":0},{"$f":"SUMIF(TMP!$B$2:$B$41,$A3,TMP!G$2:G$41)","v":0},{"$f":"SUMIF(TMP!$B$2:$B$41,$A3,TMP!H$2:H$41)","v":0},{"$f":"SUMIF(TMP!$B$2:$B$41,$A3,TMP!I$2:I$41)","v":0},{"$f":"SUMIF(TMP!$B$2:$B$41,$A3,TMP!J$2:J$41)","v":0},{"$f":"SUMIF(TMP!$B$2:$B$41,$A3,TMP!K$2:K$41)","v":0},{"$f":"SUMIF(TMP!$B$2:$B$41,$A3,TMP!L$2:L$41)","v":0},{"$f":"SUMIF(TMP!$B$2:$B$41,$A3,TMP!M$2:M$41)","v":0},{"$f":"SUMIF(TMP!$B$2:$B$41,$A3,TMP!N$2:N$41)","v":0},{"$f":"SUMIF(TMP!$B$2:$B$41,$A3,TMP!O$2:O$41)","v":0},{"$f":"SUMIF(TMP!$B$2:$B$41,$A3,TMP!P$2:P$41)","v":0}]
[{"$f":"'Otros Datos'!I4","v":"Ed Física"},{"$f":"Tabla2[[#This Row],[DIRECC]]","v":0},{"$f":"Tabla2[[#This Row],[JDEPRT]]","v":0},{"$f":"COUNTIF(CUPO!$R$3:AA$3,A4)*CUPO!$O$3+COUNTIF(CUPO!$R$4:AA$4,A4)*CUPO!$O$4+COUNTIF(CUPO!$R$5:AA$5,A4)*CUPO!$O$5+COUNTIF(CUPO!$R$6:AA$6,A4)*CUPO!$O$6+COUNTIF(CUPO!$R$7:AA$7,A4)*CUPO!$O$7+COUNTIF(CUPO!$R$8:AA$8,A4)*CUPO!$O$8+COUNTIF(CUPO!$R$9:AA$9,A4)*CUPO!$O$9+COUNTIF(CUPO!$R$10:AA$10,A4)*CUPO!$O$10","v":0},{"$f":"COUNTIF(CUPO!$R$14:$AA$14,A4)*CUPO!$O$14+COUNTIF(CUPO!$R$15:$AA$15,A4)*CUPO!$O$15+COUNTIF(CUPO!$R$16:$AA$16,A4)*CUPO!$O$16+COUNTIF(CUPO!$R$17:$AA$17,A4)*CUPO!$O$17+COUNTIF(CUPO!$R$18:$AA$18,A4)*CUPO!$O$18+COUNTIF(CUPO!$R$19:$AA$19,A4)*CUPO!$O$19","v":0},null,{"$f":"Tabla2[[#This Row],[OTR ASIG]]","v":0},{"$f":"SUMIF(TMP!$B$2:$B$41,$A4,TMP!C$2:C$41)","v":0},{"$f":"SUMIF(TMP!$B$2:$B$41,$A4,TMP!D$2:D$41)","v":0},{"$f":"SUMIF(TMP!$B$2:$B$41,$A4,TMP!E$2:E$41)","v":0},{"$f":"SUMIF(TMP!$B$2:$B$41,$A4,TMP!F$2:F$41)","v":0},{"$f":"SUMIF(TMP!$B$2:$B$41,$A4,TMP!G$2:G$41)","v":0},{"$f":"SUMIF(TMP!$B$2:$B$41,$A4,TMP!H$2:H$41)","v":0},{"$f":"SUMIF(TMP!$B$2:$B$41,$A4,TMP!I$2:I$41)","v":0},{"$f":"SUMIF(TMP!$B$2:$B$41,$A4,TMP!J$2:J$41)","v":0},{"$f":"SUMIF(TMP!$B$2:$B$41,$A4,TMP!K$2:K$41)","v":0},{"$f":"SUMIF(TMP!$B$2:$B$41,$A4,TMP!L$2:L$41)","v":0},{"$f":"SUMIF(TMP!$B$2:$B$41,$A4,TMP!M$2:M$41)","v":0},{"$f":"SUMIF(TMP!$B$2:$B$41,$A4,TMP!N$2:N$41)","v":0},{"$f":"SUMIF(TMP!$B$2:$B$41,$A4,TMP!O$2:O$41)","v":0},{"$f":"SUMIF(TMP!$B$2:$B$41,$A4,TMP!P$2:P$41)","v":0}]
[{"$f":"'Otros Datos'!I5","v":"EPV"},{"$f":"Tabla2[[#This Row],[DIRECC]]","v":0},{"$f":"Tabla2[[#This Row],[JDEPRT]]","v":0},{"$f":"COUNTIF(CUPO!$R$3:AA$3,A5)*CUPO!$O$3+COUNTIF(CUPO!$R$4:AA$4,A5)*CUPO!$O$4+COUNTIF(CUPO!$R$5:AA$5,A5)*CUPO!$O$5+COUNTIF(CUPO!$R$6:AA$6,A5)*CUPO!$O$6+COUNTIF(CUPO!$R$7:AA$7,A5)*CUPO!$O$7+COUNTIF(CUPO!$R$8:AA$8,A5)*CUPO!$O$8+COUNTIF(CUPO!$R$9:AA$9,A5)*CUPO!$O$9+COUNTIF(CUPO!$R$10:AA$10,A5)*CUPO!$O$10","v":0},{"$f":"COUNTIF(CUPO!$R$14:$AA$14,A5)*CUPO!$O$14+COUNTIF(CUPO!$R$15:$AA$15,A5)*CUPO!$O$15+COUNTIF(CUPO!$R$16:$AA$16,A5)*CUPO!$O$16+COUNTIF(CUPO!$R$17:$AA$17,A5)*CUPO!$O$17+COUNTIF(CUPO!$R$18:$AA$18,A5)*CUPO!$O$18+COUNTIF(CUPO!$R$19:$AA$19,A5)*CUPO!$O$19","v":0},null,{"$f":"Tabla2[[#This Row],[OTR ASIG]]","v":0},{"$f":"SUMIF(TMP!$B$2:$B$41,$A5,TMP!C$2:C$41)","v":0},{"$f":"SUMIF(TMP!$B$2:$B$41,$A5,TMP!D$2:D$41)","v":0},{"$f":"SUMIF(TMP!$B$2:$B$41,$A5,TMP!E$2:E$41)","v":0},{"$f":"SUMIF(TMP!$B$2:$B$41,$A5,TMP!F$2:F$41)","v":0},{"$f":"SUMIF(TMP!$B$2:$B$41,$A5,TMP!G$2:G$41)","v":0},{"$f":"SUMIF(TMP!$B$2:$B$41,$A5,TMP!H$2:H$41)","v":0},{"$f":"SUMIF(TMP!$B$2:$B$41,$A5,TMP!I$2:I$41)","v":0},{"$f":"SUMIF(TMP!$B$2:$B$41,$A5,TMP!J$2:J$41)","v":0},{"$f":"SUMIF(TMP!$B$2:$B$41,$A5,TMP!K$2:K$41)","v":0},{"$f":"SUMIF(TMP!$B$2:$B$41,$A5,TMP!L$2:L$41)","v":0},{"$f":"SUMIF(TMP!$B$2:$B$41,$A5,TMP!M$2:M$41)","v":0},{"$f":"SUMIF(TMP!$B$2:$B$41,$A5,TMP!N$2:N$41)","v":0},{"$f":"SUMIF(TMP!$B$2:$B$41,$A5,TMP!O$2:O$41)","v":0},{"$f":"SUMIF(TMP!$B$2:$B$41,$A5,TMP!P$2:P$41)","v":0}]
[{"$f":"'Otros Datos'!I6","v":"Filosofía"},{"$f":"Tabla2[[#This Row],[DIRECC]]","v":0},{"$f":"Tabla2[[#This Row],[JDEPRT]]","v":0},{"$f":"COUNTIF(CUPO!$R$3:AA$3,A6)*CUPO!$O$3+COUNTIF(CUPO!$R$4:AA$4,A6)*CUPO!$O$4+COUNTIF(CUPO!$R$5:AA$5,A6)*CUPO!$O$5+COUNTIF(CUPO!$R$6:AA$6,A6)*CUPO!$O$6+COUNTIF(CUPO!$R$7:AA$7,A6)*CUPO!$O$7+COUNTIF(CUPO!$R$8:AA$8,A6)*CUPO!$O$8+COUNTIF(CUPO!$R$9:AA$9,A6)*CUPO!$O$9+COUNTIF(CUPO!$R$10:AA$10,A6)*CUPO!$O$10","v":0},{"$f":"COUNTIF(CUPO!$R$14:$AA$14,A6)*CUPO!$O$14+COUNTIF(CUPO!$R$15:$AA$15,A6)*CUPO!$O$15+COUNTIF(CUPO!$R$16:$AA$16,A6)*CUPO!$O$16+COUNTIF(CUPO!$R$17:$AA$17,A6)*CUPO!$O$17+COUNTIF(CUPO!$R$18:$AA$18,A6)*CUPO!$O$18+COUNTIF(CUPO!$R$19:$AA$19,A6)*CUPO!$O$19","v":0},null,{"$f":"Tabla2[[#This Row],[OTR ASIG]]","v":0},{"$f":"SUMIF(TMP!$B$2:$B$41,$A6,TMP!C$2:C$41)","v":0},{"$f":"SUMIF(TMP!$B$2:$B$41,$A6,TMP!D$2:D$41)","v":0},{"$f":"SUMIF(TMP!$B$2:$B$41,$A6,TMP!E$2:E$41)","v":0},{"$f":"SUMIF(TMP!$B$2:$B$41,$A6,TMP!F$2:F$41)","v":0},{"$f":"SUMIF(TMP!$B$2:$B$41,$A6,TMP!G$2:G$41)","v":0},{"$f":"SUMIF(TMP!$B$2:$B$41,$A6,TMP!H$2:H$41)","v":0},{"$f":"SUMIF(TMP!$B$2:$B$41,$A6,TMP!I$2:I$41)","v":0},{"$f":"SUMIF(TMP!$B$2:$B$41,$A6,TMP!J$2:J$41)","v":0},{"$f":"SUMIF(TMP!$B$2:$B$41,$A6,TMP!K$2:K$41)","v":0},{"$f":"SUMIF(TMP!$B$2:$B$41,$A6,TMP!L$2:L$41)","v":0},{"$f":"SUMIF(TMP!$B$2:$B$41,$A6,TMP!M$2:M$41)","v":0},{"$f":"SUMIF(TMP!$B$2:$B$41,$A6,TMP!N$2:N$41)","v":0},{"$f":"SUMIF(TMP!$B$2:$B$41,$A6,TMP!O$2:O$41)","v":0},{"$f":"SUMIF(TMP!$B$2:$B$41,$A6,TMP!P$2:P$41)","v":0}]
[{"$f":"'Otros Datos'!I7","v":"Física y Quim"},{"$f":"Tabla2[[#This Row],[DIRECC]]","v":0},{"$f":"Tabla2[[#This Row],[JDEPRT]]","v":0},{"$f":"COUNTIF(CUPO!$R$3:AA$3,A7)*CUPO!$O$3+COUNTIF(CUPO!$R$4:AA$4,A7)*CUPO!$O$4+COUNTIF(CUPO!$R$5:AA$5,A7)*CUPO!$O$5+COUNTIF(CUPO!$R$6:AA$6,A7)*CUPO!$O$6+COUNTIF(CUPO!$R$7:AA$7,A7)*CUPO!$O$7+COUNTIF(CUPO!$R$8:AA$8,A7)*CUPO!$O$8+COUNTIF(CUPO!$R$9:AA$9,A7)*CUPO!$O$9+COUNTIF(CUPO!$R$10:AA$10,A7)*CUPO!$O$10","v":0},{"$f":"COUNTIF(CUPO!$R$14:$AA$14,A7)*CUPO!$O$14+COUNTIF(CUPO!$R$15:$AA$15,A7)*CUPO!$O$15+COUNTIF(CUPO!$R$16:$AA$16,A7)*CUPO!$O$16+COUNTIF(CUPO!$R$17:$AA$17,A7)*CUPO!$O$17+COUNTIF(CUPO!$R$18:$AA$18,A7)*CUPO!$O$18+COUNTIF(CUPO!$R$19:$AA$19,A7)*CUPO!$O$19","v":0},null,{"$f":"Tabla2[[#This Row],[OTR ASIG]]","v":0},{"$f":"SUMIF(TMP!$B$2:$B$41,$A7,TMP!C$2:C$41)","v":0},{"$f":"SUMIF(TMP!$B$2:$B$41,$A7,TMP!D$2:D$41)","v":0},{"$f":"SUMIF(TMP!$B$2:$B$41,$A7,TMP!E$2:E$41)","v":0},{"$f":"SUMIF(TMP!$B$2:$B$41,$A7,TMP!F$2:F$41)","v":0},{"$f":"SUMIF(TMP!$B$2:$B$41,$A7,TMP!G$2:G$41)","v":0},{"$f":"SUMIF(TMP!$B$2:$B$41,$A7,TMP!H$2:H$41)","v":0},{"$f":"SUMIF(TMP!$B$2:$B$41,$A7,TMP!I$2:I$41)","v":0},{"$f":"SUMIF(TMP!$B$2:$B$41,$A7,TMP!J$2:J$41)","v":0},{"$f":"SUMIF(TMP!$B$2:$B$41,$A7,TMP!K$2:K$41)","v":0},{"$f":"SUMIF(TMP!$B$2:$B$41,$A7,TMP!L$2:L$41)","v":0},{"$f":"SUMIF(TMP!$B$2:$B$41,$A7,TMP!M$2:M$41)","v":0},{"$f":"SUMIF(TMP!$B$2:$B$41,$A7,TMP!N$2:N$41)","v":0},{"$f":"SUMIF(TMP!$B$2:$B$41,$A7,TMP!O$2:O$41)","v":0},{"$f":"SUMIF(TMP!$B$2:$B$41,$A7,TMP!P$2:P$41)","v":0}]
[{"$f":"'Otros Datos'!I8","v":"FOL"},{"$f":"Tabla2[[#This Row],[DIRECC]]","v":0},{"$f":"Tabla2[[#This Row],[JDEPRT]]","v":0},{"$f":"COUNTIF(CUPO!$R$3:AA$3,A8)*CUPO!$O$3+COUNTIF(CUPO!$R$4:AA$4,A8)*CUPO!$O$4+COUNTIF(CUPO!$R$5:AA$5,A8)*CUPO!$O$5+COUNTIF(CUPO!$R$6:AA$6,A8)*CUPO!$O$6+COUNTIF(CUPO!$R$7:AA$7,A8)*CUPO!$O$7+COUNTIF(CUPO!$R$8:AA$8,A8)*CUPO!$O$8+COUNTIF(CUPO!$R$9:AA$9,A8)*CUPO!$O$9+COUNTIF(CUPO!$R$10:AA$10,A8)*CUPO!$O$10","v":0},{"$f":"COUNTIF(CUPO!$R$14:$AA$14,A8)*CUPO!$O$14+COUNTIF(CUPO!$R$15:$AA$15,A8)*CUPO!$O$15+COUNTIF(CUPO!$R$16:$AA$16,A8)*CUPO!$O$16+COUNTIF(CUPO!$R$17:$AA$17,A8)*CUPO!$O$17+COUNTIF(CUPO!$R$18:$AA$18,A8)*CUPO!$O$18+COUNTIF(CUPO!$R$19:$AA$19,A8)*CUPO!$O$19","v":0},null,{"$f":"Tabla2[[#This Row],[OTR ASIG]]","v":0},{"$f":"SUMIF(TMP!$B$2:$B$41,$A8,TMP!C$2:C$41)","v":0},{"$f":"SUMIF(TMP!$B$2:$B$41,$A8,TMP!D$2:D$41)","v":0},{"$f":"SUMIF(TMP!$B$2:$B$41,$A8,TMP!E$2:E$41)","v":0},{"$f":"SUMIF(TMP!$B$2:$B$41,$A8,TMP!F$2:F$41)","v":0},{"$f":"SUMIF(TMP!$B$2:$B$41,$A8,TMP!G$2:G$41)","v":0},{"$f":"SUMIF(TMP!$B$2:$B$41,$A8,TMP!H$2:H$41)","v":0},{"$f":"SUMIF(TMP!$B$2:$B$41,$A8,TMP!I$2:I$41)","v":0},{"$f":"SUMIF(TMP!$B$2:$B$41,$A8,TMP!J$2:J$41)","v":0},{"$f":"SUMIF(TMP!$B$2:$B$41,$A8,TMP!K$2:K$41)","v":0},{"$f":"SUMIF(TMP!$B$2:$B$41,$A8,TMP!L$2:L$41)","v":0},{"$f":"SUMIF(TMP!$B$2:$B$41,$A8,TMP!M$2:M$41)","v":0},{"$f":"SUMIF(TMP!$B$2:$B$41,$A8,TMP!N$2:N$41)","v":0},{"$f":"SUMIF(TMP!$B$2:$B$41,$A8,TMP!O$2:O$41)","v":0},{"$f":"SUMIF(TMP!$B$2:$B$41,$A8,TMP!P$2:P$41)","v":0}]
[{"$f":"'Otros Datos'!I9","v":"Francés"},{"$f":"Tabla2[[#This Row],[DIRECC]]","v":0},{"$f":"Tabla2[[#This Row],[JDEPRT]]","v":0},{"$f":"COUNTIF(CUPO!$R$3:AA$3,A9)*CUPO!$O$3+COUNTIF(CUPO!$R$4:AA$4,A9)*CUPO!$O$4+COUNTIF(CUPO!$R$5:AA$5,A9)*CUPO!$O$5+COUNTIF(CUPO!$R$6:AA$6,A9)*CUPO!$O$6+COUNTIF(CUPO!$R$7:AA$7,A9)*CUPO!$O$7+COUNTIF(CUPO!$R$8:AA$8,A9)*CUPO!$O$8+COUNTIF(CUPO!$R$9:AA$9,A9)*CUPO!$O$9+COUNTIF(CUPO!$R$10:AA$10,A9)*CUPO!$O$10","v":0},{"$f":"COUNTIF(CUPO!$R$14:$AA$14,A9)*CUPO!$O$14+COUNTIF(CUPO!$R$15:$AA$15,A9)*CUPO!$O$15+COUNTIF(CUPO!$R$16:$AA$16,A9)*CUPO!$O$16+COUNTIF(CUPO!$R$17:$AA$17,A9)*CUPO!$O$17+COUNTIF(CUPO!$R$18:$AA$18,A9)*CUPO!$O$18+COUNTIF(CUPO!$R$19:$AA$19,A9)*CUPO!$O$19","v":0},null,{"$f":"Tabla2[[#This Row],[OTR ASIG]]","v":0},{"$f":"SUMIF(TMP!$B$2:$B$41,$A9,TMP!C$2:C$41)","v":0},{"$f":"SUMIF(TMP!$B$2:$B$41,$A9,TMP!D$2:D$41)","v":0},{"$f":"SUMIF(TMP!$B$2:$B$41,$A9,TMP!E$2:E$41)","v":0},{"$f":"SUMIF(TMP!$B$2:$B$41,$A9,TMP!F$2:F$41)","v":0},{"$f":"SUMIF(TMP!$B$2:$B$41,$A9,TMP!G$2:G$41)","v":0},{"$f":"SUMIF(TMP!$B$2:$B$41,$A9,TMP!H$2:H$41)","v":0},{"$f":"SUMIF(TMP!$B$2:$B$41,$A9,TMP!I$2:I$41)","v":0},{"$f":"SUMIF(TMP!$B$2:$B$41,$A9,TMP!J$2:J$41)","v":0},{"$f":"SUMIF(TMP!$B$2:$B$41,$A9,TMP!K$2:K$41)","v":0},{"$f":"SUMIF(TMP!$B$2:$B$41,$A9,TMP!L$2:L$41)","v":0},{"$f":"SUMIF(TMP!$B$2:$B$41,$A9,TMP!M$2:M$41)","v":0},{"$f":"SUMIF(TMP!$B$2:$B$41,$A9,TMP!N$2:N$41)","v":0},{"$f":"SUMIF(TMP!$B$2:$B$41,$A9,TMP!O$2:O$41)","v":0},{"$f":"SUMIF(TMP!$B$2:$B$41,$A9,TMP!P$2:P$41)","v":0}]
[{"$f":"'Otros Datos'!I10","v":"Geografía"},{"$f":"Tabla2[[#This Row],[DIRECC]]","v":0},{"$f":"Tabla2[[#This Row],[JDEPRT]]","v":0},{"$f":"COUNTIF(CUPO!$R$3:AA$3,A10)*CUPO!$O$3+COUNTIF(CUPO!$R$4:AA$4,A10)*CUPO!$O$4+COUNTIF(CUPO!$R$5:AA$5,A10)*CUPO!$O$5+COUNTIF(CUPO!$R$6:AA$6,A10)*CUPO!$O$6+COUNTIF(CUPO!$R$7:AA$7,A10)*CUPO!$O$7+COUNTIF(CUPO!$R$8:AA$8,A10)*CUPO!$O$8+COUNTIF(CUPO!$R$9:AA$9,A10)*CUPO!$O$9+COUNTIF(CUPO!$R$10:AA$10,A10)*CUPO!$O$10","v":0},{"$f":"COUNTIF(CUPO!$R$14:$AA$14,A10)*CUPO!$O$14+COUNTIF(CUPO!$R$15:$AA$15,A10)*CUPO!$O$15+COUNTIF(CUPO!$R$16:$AA$16,A10)*CUPO!$O$16+COUNTIF(CUPO!$R$17:$AA$17,A10)*CUPO!$O$17+COUNTIF(CUPO!$R$18:$AA$18,A10)*CUPO!$O$18+COUNTIF(CUPO!$R$19:$AA$19,A10)*CUPO!$O$19","v":0},null,{"$f":"Tabla2[[#This Row],[OTR ASIG]]","v":0},{"$f":"SUMIF(TMP!$B$2:$B$41,$A10,TMP!C$2:C$41)","v":0},{"$f":"SUMIF(TMP!$B$2:$B$41,$A10,TMP!D$2:D$41)","v":0},{"$f":"SUMIF(TMP!$B$2:$B$41,$A10,TMP!E$2:E$41)","v":0},{"$f":"SUMIF(TMP!$B$2:$B$41,$A10,TMP!F$2:F$41)","v":0},{"$f":"SUMIF(TMP!$B$2:$B$41,$A10,TMP!G$2:G$41)","v":0},{"$f":"SUMIF(TMP!$B$2:$B$41,$A10,TMP!H$2:H$41)","v":0},{"$f":"SUMIF(TMP!$B$2:$B$41,$A10,TMP!I$2:I$41)","v":0},{"$f":"SUMIF(TMP!$B$2:$B$41,$A10,TMP!J$2:J$41)","v":0},{"$f":"SUMIF(TMP!$B$2:$B$41,$A10,TMP!K$2:K$41)","v":0},{"$f":"SUMIF(TMP!$B$2:$B$41,$A10,TMP!L$2:L$41)","v":0},{"$f":"SUMIF(TMP!$B$2:$B$41,$A10,TMP!M$2:M$41)","v":0},{"$f":"SUMIF(TMP!$B$2:$B$41,$A10,TMP!N$2:N$41)","v":0},{"$f":"SUMIF(TMP!$B$2:$B$41,$A10,TMP!O$2:O$41)","v":0},{"$f":"SUMIF(TMP!$B$2:$B$41,$A10,TMP!P$2:P$41)","v":0}]
[{"$f":"'Otros Datos'!I11","v":"Griego"},{"$f":"Tabla2[[#This Row],[DIRECC]]","v":0},{"$f":"Tabla2[[#This Row],[JDEPRT]]","v":0},{"$f":"COUNTIF(CUPO!$R$3:AA$3,A11)*CUPO!$O$3+COUNTIF(CUPO!$R$4:AA$4,A11)*CUPO!$O$4+COUNTIF(CUPO!$R$5:AA$5,A11)*CUPO!$O$5+COUNTIF(CUPO!$R$6:AA$6,A11)*CUPO!$O$6+COUNTIF(CUPO!$R$7:AA$7,A11)*CUPO!$O$7+COUNTIF(CUPO!$R$8:AA$8,A11)*CUPO!$O$8+COUNTIF(CUPO!$R$9:AA$9,A11)*CUPO!$O$9+COUNTIF(CUPO!$R$10:AA$10,A11)*CUPO!$O$10","v":0},{"$f":"COUNTIF(CUPO!$R$14:$AA$14,A11)*CUPO!$O$14+COUNTIF(CUPO!$R$15:$AA$15,A11)*CUPO!$O$15+COUNTIF(CUPO!$R$16:$AA$16,A11)*CUPO!$O$16+COUNTIF(CUPO!$R$17:$AA$17,A11)*CUPO!$O$17+COUNTIF(CUPO!$R$18:$AA$18,A11)*CUPO!$O$18+COUNTIF(CUPO!$R$19:$AA$19,A11)*CUPO!$O$19","v":0},null,{"$f":"Tabla2[[#This Row],[OTR ASIG]]","v":0},{"$f":"SUMIF(TMP!$B$2:$B$41,$A11,TMP!C$2:C$41)","v":0},{"$f":"SUMIF(TMP!$B$2:$B$41,$A11,TMP!D$2:D$41)","v":0},{"$f":"SUMIF(TMP!$B$2:$B$41,$A11,TMP!E$2:E$41)","v":0},{"$f":"SUMIF(TMP!$B$2:$B$41,$A11,TMP!F$2:F$41)","v":0},{"$f":"SUMIF(TMP!$B$2:$B$41,$A11,TMP!G$2:G$41)","v":0},{"$f":"SUMIF(TMP!$B$2:$B$41,$A11,TMP!H$2:H$41)","v":0},{"$f":"SUMIF(TMP!$B$2:$B$41,$A11,TMP!I$2:I$41)","v":0},{"$f":"SUMIF(TMP!$B$2:$B$41,$A11,TMP!J$2:J$41)","v":0},{"$f":"SUMIF(TMP!$B$2:$B$41,$A11,TMP!K$2:K$41)","v":0},{"$f":"SUMIF(TMP!$B$2:$B$41,$A11,TMP!L$2:L$41)","v":0},{"$f":"SUMIF(TMP!$B$2:$B$41,$A11,TMP!M$2:M$41)","v":0},{"$f":"SUMIF(TMP!$B$2:$B$41,$A11,TMP!N$2:N$41)","v":0},{"$f":"SUMIF(TMP!$B$2:$B$41,$A11,TMP!O$2:O$41)","v":0},{"$f":"SUMIF(TMP!$B$2:$B$41,$A11,TMP!P$2:P$41)","v":0}]
[{"$f":"'Otros Datos'!I12","v":"Inglés"},{"$f":"Tabla2[[#This Row],[DIRECC]]","v":0},{"$f":"Tabla2[[#This Row],[JDEPRT]]","v":0},{"$f":"COUNTIF(CUPO!$R$3:AA$3,A12)*CUPO!$O$3+COUNTIF(CUPO!$R$4:AA$4,A12)*CUPO!$O$4+COUNTIF(CUPO!$R$5:AA$5,A12)*CUPO!$O$5+COUNTIF(CUPO!$R$6:AA$6,A12)*CUPO!$O$6+COUNTIF(CUPO!$R$7:AA$7,A12)*CUPO!$O$7+COUNTIF(CUPO!$R$8:AA$8,A12)*CUPO!$O$8+COUNTIF(CUPO!$R$9:AA$9,A12)*CUPO!$O$9+COUNTIF(CUPO!$R$10:AA$10,A12)*CUPO!$O$10","v":0},{"$f":"COUNTIF(CUPO!$R$14:$AA$14,A12)*CUPO!$O$14+COUNTIF(CUPO!$R$15:$AA$15,A12)*CUPO!$O$15+COUNTIF(CUPO!$R$16:$AA$16,A12)*CUPO!$O$16+COUNTIF(CUPO!$R$17:$AA$17,A12)*CUPO!$O$17+COUNTIF(CUPO!$R$18:$AA$18,A12)*CUPO!$O$18+COUNTIF(CUPO!$R$19:$AA$19,A12)*CUPO!$O$19","v":0},null,{"$f":"Tabla2[[#This Row],[OTR ASIG]]","v":0},{"$f":"SUMIF(TMP!$B$2:$B$41,$A12,TMP!C$2:C$41)","v":0},{"$f":"SUMIF(TMP!$B$2:$B$41,$A12,TMP!D$2:D$41)","v":0},{"$f":"SUMIF(TMP!$B$2:$B$41,$A12,TMP!E$2:E$41)","v":0},{"$f":"SUMIF(TMP!$B$2:$B$41,$A12,TMP!F$2:F$41)","v":0},{"$f":"SUMIF(TMP!$B$2:$B$41,$A12,TMP!G$2:G$41)","v":0},{"$f":"SUMIF(TMP!$B$2:$B$41,$A12,TMP!H$2:H$41)","v":0},{"$f":"SUMIF(TMP!$B$2:$B$41,$A12,TMP!I$2:I$41)","v":0},{"$f":"SUMIF(TMP!$B$2:$B$41,$A12,TMP!J$2:J$41)","v":0},{"$f":"SUMIF(TMP!$B$2:$B$41,$A12,TMP!K$2:K$41)","v":0},{"$f":"SUMIF(TMP!$B$2:$B$41,$A12,TMP!L$2:L$41)","v":0},{"$f":"SUMIF(TMP!$B$2:$B$41,$A12,TMP!M$2:M$41)","v":0},{"$f":"SUMIF(TMP!$B$2:$B$41,$A12,TMP!N$2:N$41)","v":0},{"$f":"SUMIF(TMP!$B$2:$B$41,$A12,TMP!O$2:O$41)","v":0},{"$f":"SUMIF(TMP!$B$2:$B$41,$A12,TMP!P$2:P$41)","v":0}]
[{"$f":"'Otros Datos'!I13","v":"Latín"},{"$f":"Tabla2[[#This Row],[DIRECC]]","v":0},{"$f":"Tabla2[[#This Row],[JDEPRT]]","v":0},{"$f":"COUNTIF(CUPO!$R$3:AA$3,A13)*CUPO!$O$3+COUNTIF(CUPO!$R$4:AA$4,A13)*CUPO!$O$4+COUNTIF(CUPO!$R$5:AA$5,A13)*CUPO!$O$5+COUNTIF(CUPO!$R$6:AA$6,A13)*CUPO!$O$6+COUNTIF(CUPO!$R$7:AA$7,A13)*CUPO!$O$7+COUNTIF(CUPO!$R$8:AA$8,A13)*CUPO!$O$8+COUNTIF(CUPO!$R$9:AA$9,A13)*CUPO!$O$9+COUNTIF(CUPO!$R$10:AA$10,A13)*CUPO!$O$10","v":0},{"$f":"COUNTIF(CUPO!$R$14:$AA$14,A13)*CUPO!$O$14+COUNTIF(CUPO!$R$15:$AA$15,A13)*CUPO!$O$15+COUNTIF(CUPO!$R$16:$AA$16,A13)*CUPO!$O$16+COUNTIF(CUPO!$R$17:$AA$17,A13)*CUPO!$O$17+COUNTIF(CUPO!$R$18:$AA$18,A13)*CUPO!$O$18+COUNTIF(CUPO!$R$19:$AA$19,A13)*CUPO!$O$19","v":0},null,{"$f":"Tabla2[[#This Row],[OTR ASIG]]","v":0},{"$f":"SUMIF(TMP!$B$2:$B$41,$A13,TMP!C$2:C$41)","v":0},{"$f":"SUMIF(TMP!$B$2:$B$41,$A13,TMP!D$2:D$41)","v":0},{"$f":"SUMIF(TMP!$B$2:$B$41,$A13,TMP!E$2:E$41)","v":0},{"$f":"SUMIF(TMP!$B$2:$B$41,$A13,TMP!F$2:F$41)","v":0},{"$f":"SUMIF(TMP!$B$2:$B$41,$A13,TMP!G$2:G$41)","v":0},{"$f":"SUMIF(TMP!$B$2:$B$41,$A13,TMP!H$2:H$41)","v":0},{"$f":"SUMIF(TMP!$B$2:$B$41,$A13,TMP!I$2:I$41)","v":0},{"$f":"SUMIF(TMP!$B$2:$B$41,$A13,TMP!J$2:J$41)","v":0},{"$f":"SUMIF(TMP!$B$2:$B$41,$A13,TMP!K$2:K$41)","v":0},{"$f":"SUMIF(TMP!$B$2:$B$41,$A13,TMP!L$2:L$41)","v":0},{"$f":"SUMIF(TMP!$B$2:$B$41,$A13,TMP!M$2:M$41)","v":0},{"$f":"SUMIF(TMP!$B$2:$B$41,$A13,TMP!N$2:N$41)","v":0},{"$f":"SUMIF(TMP!$B$2:$B$41,$A13,TMP!O$2:O$41)","v":0},{"$f":"SUMIF(TMP!$B$2:$B$41,$A13,TMP!P$2:P$41)","v":0}]
[{"$f":"'Otros Datos'!I14","v":"Lengua"},{"$f":"Tabla2[[#This Row],[DIRECC]]","v":0},{"$f":"Tabla2[[#This Row],[JDEPRT]]","v":0},{"$f":"COUNTIF(CUPO!$R$3:AA$3,A14)*CUPO!$O$3+COUNTIF(CUPO!$R$4:AA$4,A14)*CUPO!$O$4+COUNTIF(CUPO!$R$5:AA$5,A14)*CUPO!$O$5+COUNTIF(CUPO!$R$6:AA$6,A14)*CUPO!$O$6+COUNTIF(CUPO!$R$7:AA$7,A14)*CUPO!$O$7+COUNTIF(CUPO!$R$8:AA$8,A14)*CUPO!$O$8+COUNTIF(CUPO!$R$9:AA$9,A14)*CUPO!$O$9+COUNTIF(CUPO!$R$10:AA$10,A14)*CUPO!$O$10","v":0},{"$f":"COUNTIF(CUPO!$R$14:$AA$14,A14)*CUPO!$O$14+COUNTIF(CUPO!$R$15:$AA$15,A14)*CUPO!$O$15+COUNTIF(CUPO!$R$16:$AA$16,A14)*CUPO!$O$16+COUNTIF(CUPO!$R$17:$AA$17,A14)*CUPO!$O$17+COUNTIF(CUPO!$R$18:$AA$18,A14)*CUPO!$O$18+COUNTIF(CUPO!$R$19:$AA$19,A14)*CUPO!$O$19","v":0},null,{"$f":"Tabla2[[#This Row],[OTR ASIG]]","v":0},{"$f":"SUMIF(TMP!$B$2:$B$41,$A14,TMP!C$2:C$41)","v":0},{"$f":"SUMIF(TMP!$B$2:$B$41,$A14,TMP!D$2:D$41)","v":0},{"$f":"SUMIF(TMP!$B$2:$B$41,$A14,TMP!E$2:E$41)","v":0},{"$f":"SUMIF(TMP!$B$2:$B$41,$A14,TMP!F$2:F$41)","v":0},{"$f":"SUMIF(TMP!$B$2:$B$41,$A14,TMP!G$2:G$41)","v":0},{"$f":"SUMIF(TMP!$B$2:$B$41,$A14,TMP!H$2:H$41)","v":0},{"$f":"SUMIF(TMP!$B$2:$B$41,$A14,TMP!I$2:I$41)","v":0},{"$f":"SUMIF(TMP!$B$2:$B$41,$A14,TMP!J$2:J$41)","v":0},{"$f":"SUMIF(TMP!$B$2:$B$41,$A14,TMP!K$2:K$41)","v":0},{"$f":"SUMIF(TMP!$B$2:$B$41,$A14,TMP!L$2:L$41)","v":0},{"$f":"SUMIF(TMP!$B$2:$B$41,$A14,TMP!M$2:M$41)","v":0},{"$f":"SUMIF(TMP!$B$2:$B$41,$A14,TMP!N$2:N$41)","v":0},{"$f":"SUMIF(TMP!$B$2:$B$41,$A14,TMP!O$2:O$41)","v":0},{"$f":"SUMIF(TMP!$B$2:$B$41,$A14,TMP!P$2:P$41)","v":0}]
[{"$f":"'Otros Datos'!I15","v":"Matemáticas"},{"$f":"Tabla2[[#This Row],[DIRECC]]","v":0},{"$f":"Tabla2[[#This Row],[JDEPRT]]","v":0},{"$f":"COUNTIF(CUPO!$R$3:AA$3,A15)*CUPO!$O$3+COUNTIF(CUPO!$R$4:AA$4,A15)*CUPO!$O$4+COUNTIF(CUPO!$R$5:AA$5,A15)*CUPO!$O$5+COUNTIF(CUPO!$R$6:AA$6,A15)*CUPO!$O$6+COUNTIF(CUPO!$R$7:AA$7,A15)*CUPO!$O$7+COUNTIF(CUPO!$R$8:AA$8,A15)*CUPO!$O$8+COUNTIF(CUPO!$R$9:AA$9,A15)*CUPO!$O$9+COUNTIF(CUPO!$R$10:AA$10,A15)*CUPO!$O$10","v":0},{"$f":"COUNTIF(CUPO!$R$14:$AA$14,A15)*CUPO!$O$14+COUNTIF(CUPO!$R$15:$AA$15,A15)*CUPO!$O$15+COUNTIF(CUPO!$R$16:$AA$16,A15)*CUPO!$O$16+COUNTIF(CUPO!$R$17:$AA$17,A15)*CUPO!$O$17+COUNTIF(CUPO!$R$18:$AA$18,A15)*CUPO!$O$18+COUNTIF(CUPO!$R$19:$AA$19,A15)*CUPO!$O$19","v":0},null,{"$f":"Tabla2[[#This Row],[OTR ASIG]]","v":0},{"$f":"SUMIF(TMP!$B$2:$B$41,$A15,TMP!C$2:C$41)","v":0},{"$f":"SUMIF(TMP!$B$2:$B$41,$A15,TMP!D$2:D$41)","v":0},{"$f":"SUMIF(TMP!$B$2:$B$41,$A15,TMP!E$2:E$41)","v":0},{"$f":"SUMIF(TMP!$B$2:$B$41,$A15,TMP!F$2:F$41)","v":0},{"$f":"SUMIF(TMP!$B$2:$B$41,$A15,TMP!G$2:G$41)","v":0},{"$f":"SUMIF(TMP!$B$2:$B$41,$A15,TMP!H$2:H$41)","v":0},{"$f":"SUMIF(TMP!$B$2:$B$41,$A15,TMP!I$2:I$41)","v":0},{"$f":"SUMIF(TMP!$B$2:$B$41,$A15,TMP!J$2:J$41)","v":0},{"$f":"SUMIF(TMP!$B$2:$B$41,$A15,TMP!K$2:K$41)","v":0},{"$f":"SUMIF(TMP!$B$2:$B$41,$A15,TMP!L$2:L$41)","v":0},{"$f":"SUMIF(TMP!$B$2:$B$41,$A15,TMP!M$2:M$41)","v":0},{"$f":"SUMIF(TMP!$B$2:$B$41,$A15,TMP!N$2:N$41)","v":0},{"$f":"SUMIF(TMP!$B$2:$B$41,$A15,TMP!O$2:O$41)","v":0},{"$f":"SUMIF(TMP!$B$2:$B$41,$A15,TMP!P$2:P$41)","v":0}]
[{"$f":"'Otros Datos'!I16","v":"Música"},{"$f":"Tabla2[[#This Row],[DIRECC]]","v":0},{"$f":"Tabla2[[#This Row],[JDEPRT]]","v":0},{"$f":"COUNTIF(CUPO!$R$3:AA$3,A16)*CUPO!$O$3+COUNTIF(CUPO!$R$4:AA$4,A16)*CUPO!$O$4+COUNTIF(CUPO!$R$5:AA$5,A16)*CUPO!$O$5+COUNTIF(CUPO!$R$6:AA$6,A16)*CUPO!$O$6+COUNTIF(CUPO!$R$7:AA$7,A16)*CUPO!$O$7+COUNTIF(CUPO!$R$8:AA$8,A16)*CUPO!$O$8+COUNTIF(CUPO!$R$9:AA$9,A16)*CUPO!$O$9+COUNTIF(CUPO!$R$10:AA$10,A16)*CUPO!$O$10","v":0},{"$f":"COUNTIF(CUPO!$R$14:$AA$14,A16)*CUPO!$O$14+COUNTIF(CUPO!$R$15:$AA$15,A16)*CUPO!$O$15+COUNTIF(CUPO!$R$16:$AA$16,A16)*CUPO!$O$16+COUNTIF(CUPO!$R$17:$AA$17,A16)*CUPO!$O$17+COUNTIF(CUPO!$R$18:$AA$18,A16)*CUPO!$O$18+COUNTIF(CUPO!$R$19:$AA$19,A16)*CUPO!$O$19","v":0},null,{"$f":"Tabla2[[#This Row],[OTR ASIG]]","v":0},{"$f":"SUMIF(TMP!$B$2:$B$41,$A16,TMP!C$2:C$41)","v":0},{"$f":"SUMIF(TMP!$B$2:$B$41,$A16,TMP!D$2:D$41)","v":0},{"$f":"SUMIF(TMP!$B$2:$B$41,$A16,TMP!E$2:E$41)","v":0},{"$f":"SUMIF(TMP!$B$2:$B$41,$A16,TMP!F$2:F$41)","v":0},{"$f":"SUMIF(TMP!$B$2:$B$41,$A16,TMP!G$2:G$41)","v":0},{"$f":"SUMIF(TMP!$B$2:$B$41,$A16,TMP!H$2:H$41)","v":0},{"$f":"SUMIF(TMP!$B$2:$B$41,$A16,TMP!I$2:I$41)","v":0},{"$f":"SUMIF(TMP!$B$2:$B$41,$A16,TMP!J$2:J$41)","v":0},{"$f":"SUMIF(TMP!$B$2:$B$41,$A16,TMP!K$2:K$41)","v":0},{"$f":"SUMIF(TMP!$B$2:$B$41,$A16,TMP!L$2:L$41)","v":0},{"$f":"SUMIF(TMP!$B$2:$B$41,$A16,TMP!M$2:M$41)","v":0},{"$f":"SUMIF(TMP!$B$2:$B$41,$A16,TMP!N$2:N$41)","v":0},{"$f":"SUMIF(TMP!$B$2:$B$41,$A16,TMP!O$2:O$41)","v":0},{"$f":"SUMIF(TMP!$B$2:$B$41,$A16,TMP!P$2:P$41)","v":0}]
[{"$f":"'Otros Datos'!I17","v":"Orientación"},{"$f":"Tabla2[[#This Row],[DIRECC]]","v":0},{"$f":"Tabla2[[#This Row],[JDEPRT]]","v":0},{"$f":"COUNTIF(CUPO!$R$3:AA$3,A17)*CUPO!$O$3+COUNTIF(CUPO!$R$4:AA$4,A17)*CUPO!$O$4+COUNTIF(CUPO!$R$5:AA$5,A17)*CUPO!$O$5+COUNTIF(CUPO!$R$6:AA$6,A17)*CUPO!$O$6+COUNTIF(CUPO!$R$7:AA$7,A17)*CUPO!$O$7+COUNTIF(CUPO!$R$8:AA$8,A17)*CUPO!$O$8+COUNTIF(CUPO!$R$9:AA$9,A17)*CUPO!$O$9+COUNTIF(CUPO!$R$10:AA$10,A17)*CUPO!$O$10","v":0},{"$f":"COUNTIF(CUPO!$R$14:$AA$14,A17)*CUPO!$O$14+COUNTIF(CUPO!$R$15:$AA$15,A17)*CUPO!$O$15+COUNTIF(CUPO!$R$16:$AA$16,A17)*CUPO!$O$16+COUNTIF(CUPO!$R$17:$AA$17,A17)*CUPO!$O$17+COUNTIF(CUPO!$R$18:$AA$18,A17)*CUPO!$O$18+COUNTIF(CUPO!$R$19:$AA$19,A17)*CUPO!$O$19","v":0},null,{"$f":"Tabla2[[#This Row],[OTR ASIG]]","v":0},{"$f":"SUMIF(TMP!$B$2:$B$41,$A17,TMP!C$2:C$41)","v":0},{"$f":"SUMIF(TMP!$B$2:$B$41,$A17,TMP!D$2:D$41)","v":0},{"$f":"SUMIF(TMP!$B$2:$B$41,$A17,TMP!E$2:E$41)","v":0},{"$f":"SUMIF(TMP!$B$2:$B$41,$A17,TMP!F$2:F$41)","v":0},{"$f":"SUMIF(TMP!$B$2:$B$41,$A17,TMP!G$2:G$41)","v":0},{"$f":"SUMIF(TMP!$B$2:$B$41,$A17,TMP!H$2:H$41)","v":0},{"$f":"SUMIF(TMP!$B$2:$B$41,$A17,TMP!I$2:I$41)","v":0},{"$f":"SUMIF(TMP!$B$2:$B$41,$A17,TMP!J$2:J$41)","v":0},{"$f":"SUMIF(TMP!$B$2:$B$41,$A17,TMP!K$2:K$41)","v":0},{"$f":"SUMIF(TMP!$B$2:$B$41,$A17,TMP!L$2:L$41)","v":0},{"$f":"SUMIF(TMP!$B$2:$B$41,$A17,TMP!M$2:M$41)","v":0},{"$f":"SUMIF(TMP!$B$2:$B$41,$A17,TMP!N$2:N$41)","v":0},{"$f":"SUMIF(TMP!$B$2:$B$41,$A17,TMP!O$2:O$41)","v":0},{"$f":"SUMIF(TMP!$B$2:$B$41,$A17,TMP!P$2:P$41)","v":0}]
[{"$f":"'Otros Datos'!I18","v":"Tecnología"},{"$f":"Tabla2[[#This Row],[DIRECC]]","v":0},{"$f":"Tabla2[[#This Row],[JDEPRT]]","v":0},{"$f":"COUNTIF(CUPO!$R$3:AA$3,A18)*CUPO!$O$3+COUNTIF(CUPO!$R$4:AA$4,A18)*CUPO!$O$4+COUNTIF(CUPO!$R$5:AA$5,A18)*CUPO!$O$5+COUNTIF(CUPO!$R$6:AA$6,A18)*CUPO!$O$6+COUNTIF(CUPO!$R$7:AA$7,A18)*CUPO!$O$7+COUNTIF(CUPO!$R$8:AA$8,A18)*CUPO!$O$8+COUNTIF(CUPO!$R$9:AA$9,A18)*CUPO!$O$9+COUNTIF(CUPO!$R$10:AA$10,A18)*CUPO!$O$10","v":0},{"$f":"COUNTIF(CUPO!$R$14:$AA$14,A18)*CUPO!$O$14+COUNTIF(CUPO!$R$15:$AA$15,A18)*CUPO!$O$15+COUNTIF(CUPO!$R$16:$AA$16,A18)*CUPO!$O$16+COUNTIF(CUPO!$R$17:$AA$17,A18)*CUPO!$O$17+COUNTIF(CUPO!$R$18:$AA$18,A18)*CUPO!$O$18+COUNTIF(CUPO!$R$19:$AA$19,A18)*CUPO!$O$19","v":0},null,{"$f":"Tabla2[[#This Row],[OTR ASIG]]","v":0},{"$f":"SUMIF(TMP!$B$2:$B$41,$A18,TMP!C$2:C$41)","v":0},{"$f":"SUMIF(TMP!$B$2:$B$41,$A18,TMP!D$2:D$41)","v":0},{"$f":"SUMIF(TMP!$B$2:$B$41,$A18,TMP!E$2:E$41)","v":0},{"$f":"SUMIF(TMP!$B$2:$B$41,$A18,TMP!F$2:F$41)","v":0},{"$f":"SUMIF(TMP!$B$2:$B$41,$A18,TMP!G$2:G$41)","v":0},{"$f":"SUMIF(TMP!$B$2:$B$41,$A18,TMP!H$2:H$41)","v":0},{"$f":"SUMIF(TMP!$B$2:$B$41,$A18,TMP!I$2:I$41)","v":0},{"$f":"SUMIF(TMP!$B$2:$B$41,$A18,TMP!J$2:J$41)","v":0},{"$f":"SUMIF(TMP!$B$2:$B$41,$A18,TMP!K$2:K$41)","v":0},{"$f":"SUMIF(TMP!$B$2:$B$41,$A18,TMP!L$2:L$41)","v":0},{"$f":"SUMIF(TMP!$B$2:$B$41,$A18,TMP!M$2:M$41)","v":0},{"$f":"SUMIF(TMP!$B$2:$B$41,$A18,TMP!N$2:N$41)","v":0},{"$f":"SUMIF(TMP!$B$2:$B$41,$A18,TMP!O$2:O$41)","v":0},{"$f":"SUMIF(TMP!$B$2:$B$41,$A18,TMP!P$2:P$41)","v":0}]
[{"$f":"'Otros Datos'!I19","v":"Depart 1"},{"$f":"Tabla2[[#This Row],[DIRECC]]","v":0},{"$f":"Tabla2[[#This Row],[JDEPRT]]","v":0},{"$f":"COUNTIF(CUPO!$R$3:AA$3,A19)*CUPO!$O$3+COUNTIF(CUPO!$R$4:AA$4,A19)*CUPO!$O$4+COUNTIF(CUPO!$R$5:AA$5,A19)*CUPO!$O$5+COUNTIF(CUPO!$R$6:AA$6,A19)*CUPO!$O$6+COUNTIF(CUPO!$R$7:AA$7,A19)*CUPO!$O$7+COUNTIF(CUPO!$R$8:AA$8,A19)*CUPO!$O$8+COUNTIF(CUPO!$R$9:AA$9,A19)*CUPO!$O$9+COUNTIF(CUPO!$R$10:AA$10,A19)*CUPO!$O$10","v":0},{"$f":"COUNTIF(CUPO!$R$14:$AA$14,A19)*CUPO!$O$14+COUNTIF(CUPO!$R$15:$AA$15,A19)*CUPO!$O$15+COUNTIF(CUPO!$R$16:$AA$16,A19)*CUPO!$O$16+COUNTIF(CUPO!$R$17:$AA$17,A19)*CUPO!$O$17+COUNTIF(CUPO!$R$18:$AA$18,A19)*CUPO!$O$18+COUNTIF(CUPO!$R$19:$AA$19,A19)*CUPO!$O$19","v":0},null,{"$f":"Tabla2[[#This Row],[OTR ASIG]]","v":0},{"$f":"SUMIF(TMP!$B$2:$B$41,$A19,TMP!C$2:C$41)","v":0},{"$f":"SUMIF(TMP!$B$2:$B$41,$A19,TMP!D$2:D$41)","v":0},{"$f":"SUMIF(TMP!$B$2:$B$41,$A19,TMP!E$2:E$41)","v":0},{"$f":"SUMIF(TMP!$B$2:$B$41,$A19,TMP!F$2:F$41)","v":0},{"$f":"SUMIF(TMP!$B$2:$B$41,$A19,TMP!G$2:G$41)","v":0},{"$f":"SUMIF(TMP!$B$2:$B$41,$A19,TMP!H$2:H$41)","v":0},{"$f":"SUMIF(TMP!$B$2:$B$41,$A19,TMP!I$2:I$41)","v":0},{"$f":"SUMIF(TMP!$B$2:$B$41,$A19,TMP!J$2:J$41)","v":0},{"$f":"SUMIF(TMP!$B$2:$B$41,$A19,TMP!K$2:K$41)","v":0},{"$f":"SUMIF(TMP!$B$2:$B$41,$A19,TMP!L$2:L$41)","v":0},{"$f":"SUMIF(TMP!$B$2:$B$41,$A19,TMP!M$2:M$41)","v":0},{"$f":"SUMIF(TMP!$B$2:$B$41,$A19,TMP!N$2:N$41)","v":0},{"$f":"SUMIF(TMP!$B$2:$B$41,$A19,TMP!O$2:O$41)","v":0},{"$f":"SUMIF(TMP!$B$2:$B$41,$A19,TMP!P$2:P$41)","v":0}]
[{"$f":"'Otros Datos'!I20","v":"Depart 2"},{"$f":"Tabla2[[#This Row],[DIRECC]]","v":0},{"$f":"Tabla2[[#This Row],[JDEPRT]]","v":0},{"$f":"COUNTIF(CUPO!$R$3:AA$3,A20)*CUPO!$O$3+COUNTIF(CUPO!$R$4:AA$4,A20)*CUPO!$O$4+COUNTIF(CUPO!$R$5:AA$5,A20)*CUPO!$O$5+COUNTIF(CUPO!$R$6:AA$6,A20)*CUPO!$O$6+COUNTIF(CUPO!$R$7:AA$7,A20)*CUPO!$O$7+COUNTIF(CUPO!$R$8:AA$8,A20)*CUPO!$O$8+COUNTIF(CUPO!$R$9:AA$9,A20)*CUPO!$O$9+COUNTIF(CUPO!$R$10:AA$10,A20)*CUPO!$O$10","v":0},{"$f":"COUNTIF(CUPO!$R$14:$AA$14,A20)*CUPO!$O$14+COUNTIF(CUPO!$R$15:$AA$15,A20)*CUPO!$O$15+COUNTIF(CUPO!$R$16:$AA$16,A20)*CUPO!$O$16+COUNTIF(CUPO!$R$17:$AA$17,A20)*CUPO!$O$17+COUNTIF(CUPO!$R$18:$AA$18,A20)*CUPO!$O$18+COUNTIF(CUPO!$R$19:$AA$19,A20)*CUPO!$O$19","v":0},null,{"$f":"Tabla2[[#This Row],[OTR ASIG]]","v":0},{"$f":"SUMIF(TMP!$B$2:$B$41,$A20,TMP!C$2:C$41)","v":0},{"$f":"SUMIF(TMP!$B$2:$B$41,$A20,TMP!D$2:D$41)","v":0},{"$f":"SUMIF(TMP!$B$2:$B$41,$A20,TMP!E$2:E$41)","v":0},{"$f":"SUMIF(TMP!$B$2:$B$41,$A20,TMP!F$2:F$41)","v":0},{"$f":"SUMIF(TMP!$B$2:$B$41,$A20,TMP!G$2:G$41)","v":0},{"$f":"SUMIF(TMP!$B$2:$B$41,$A20,TMP!H$2:H$41)","v":0},{"$f":"SUMIF(TMP!$B$2:$B$41,$A20,TMP!I$2:I$41)","v":0},{"$f":"SUMIF(TMP!$B$2:$B$41,$A20,TMP!J$2:J$41)","v":0},{"$f":"SUMIF(TMP!$B$2:$B$41,$A20,TMP!K$2:K$41)","v":0},{"$f":"SUMIF(TMP!$B$2:$B$41,$A20,TMP!L$2:L$41)","v":0},{"$f":"SUMIF(TMP!$B$2:$B$41,$A20,TMP!M$2:M$41)","v":0},{"$f":"SUMIF(TMP!$B$2:$B$41,$A20,TMP!N$2:N$41)","v":0},{"$f":"SUMIF(TMP!$B$2:$B$41,$A20,TMP!O$2:O$41)","v":0},{"$f":"SUMIF(TMP!$B$2:$B$41,$A20,TMP!P$2:P$41)","v":0}]
[{"$f":"'Otros Datos'!I21","v":"Depart 3"},{"$f":"Tabla2[[#This Row],[DIRECC]]","v":0},{"$f":"Tabla2[[#This Row],[JDEPRT]]","v":0},{"$f":"COUNTIF(CUPO!$R$3:AA$3,A21)*CUPO!$O$3+COUNTIF(CUPO!$R$4:AA$4,A21)*CUPO!$O$4+COUNTIF(CUPO!$R$5:AA$5,A21)*CUPO!$O$5+COUNTIF(CUPO!$R$6:AA$6,A21)*CUPO!$O$6+COUNTIF(CUPO!$R$7:AA$7,A21)*CUPO!$O$7+COUNTIF(CUPO!$R$8:AA$8,A21)*CUPO!$O$8+COUNTIF(CUPO!$R$9:AA$9,A21)*CUPO!$O$9+COUNTIF(CUPO!$R$10:AA$10,A21)*CUPO!$O$10","v":0},{"$f":"COUNTIF(CUPO!$R$14:$AA$14,A21)*CUPO!$O$14+COUNTIF(CUPO!$R$15:$AA$15,A21)*CUPO!$O$15+COUNTIF(CUPO!$R$16:$AA$16,A21)*CUPO!$O$16+COUNTIF(CUPO!$R$17:$AA$17,A21)*CUPO!$O$17+COUNTIF(CUPO!$R$18:$AA$18,A21)*CUPO!$O$18+COUNTIF(CUPO!$R$19:$AA$19,A21)*CUPO!$O$19","v":0},null,{"$f":"Tabla2[[#This Row],[OTR ASIG]]","v":0},{"$f":"SUMIF(TMP!$B$2:$B$41,$A21,TMP!C$2:C$41)","v":0},{"$f":"SUMIF(TMP!$B$2:$B$41,$A21,TMP!D$2:D$41)","v":0},{"$f":"SUMIF(TMP!$B$2:$B$41,$A21,TMP!E$2:E$41)","v":0},{"$f":"SUMIF(TMP!$B$2:$B$41,$A21,TMP!F$2:F$41)","v":0},{"$f":"SUMIF(TMP!$B$2:$B$41,$A21,TMP!G$2:G$41)","v":0},{"$f":"SUMIF(TMP!$B$2:$B$41,$A21,TMP!H$2:H$41)","v":0},{"$f":"SUMIF(TMP!$B$2:$B$41,$A21,TMP!I$2:I$41)","v":0},{"$f":"SUMIF(TMP!$B$2:$B$41,$A21,TMP!J$2:J$41)","v":0},{"$f":"SUMIF(TMP!$B$2:$B$41,$A21,TMP!K$2:K$41)","v":0},{"$f":"SUMIF(TMP!$B$2:$B$41,$A21,TMP!L$2:L$41)","v":0},{"$f":"SUMIF(TMP!$B$2:$B$41,$A21,TMP!M$2:M$41)","v":0},{"$f":"SUMIF(TMP!$B$2:$B$41,$A21,TMP!N$2:N$41)","v":0},{"$f":"SUMIF(TMP!$B$2:$B$41,$A21,TMP!O$2:O$41)","v":0},{"$f":"SUMIF(TMP!$B$2:$B$41,$A21,TMP!P$2:P$41)","v":0}]

{"sheet":"AUX_Datos","index":7,"n_rows":522,"n_cols":8,"rows_kept":522,"cut":false,"hidden":true,"merged":[]}
[]
["ASIGNATURA","DEPART_aux","DEPARTAMENTO","CURSO","numSesiones","OPT","numGrupos","numHoras"]
[{"$f":"Datos!A3","v":"Biología"},{"$f":"Datos!B3","v":0},{"$f":"IF(H3<>0,B3,\"\")","v":""},"1º ESO",{"$f":"Datos!C3","v":0},{"$f":"Datos!D3","v":0},{"$f":"IF(Datos!D3<>\"S\",Datos!F$1,Datos!E3)","v":0},{"$f":"Datos!F3","v":0}]
[{"$f":"Datos!A4","v":"Dibujo"},{"$f":"Datos!B4","v":0},{"$f":"IF(H4<>0,B4,\"\")","v":""},"1º ESO",{"$f":"Datos!C4","v":0},{"$f":"Datos!D4","v":0},{"$f":"IF(Datos!D4<>\"S\",Datos!F$1,Datos!E4)","v":0},{"$f":"Datos!F4","v":0}]
[{"$f":"Datos!A5","v":"Ed Fisica"},{"$f":"Datos!B5","v":0},"","1º ESO",{"$f":"Datos!C5","v":0},{"$f":"Datos!D5","v":0},{"$f":"IF(Datos!D5<>\"S\",Datos!F$1,Datos!E5)","v":0},{"$f":"Datos!F5","v":0}]
[{"$f":"Datos!A6","v":"Ética"},{"$f":"Datos!B6","v":0},"","1º ESO",{"$f":"Datos!C6","v":0},{"$f":"Datos!D6","v":0},{"$f":"IF(Datos!D6<>\"S\",Datos!F$1,Datos!E6)","v":0},{"$f":"Datos!F6","v":0}]
[{"$f":"Datos!A7","v":"Física y Quím"},{"$f":"Datos!B7","v":0},"","1º ESO",{"$f":"Datos!C7","v":0},{"$f":"Datos!D7","v":0},{"$f":"IF(Datos!D7<>\"S\",Datos!F$1,Datos!E7)","v":0},{"$f":"Datos!F7","v":0}]
[{"$f":"Datos!A8","v":"Francés"},{"$f":"Datos!B8","v":0},"","1º ESO",{"$f":"Datos!C8","v":0},{"$f":"Datos!D8","v":0},{"$f":"IF(Datos!D8<>\"S\",Datos!F$1,Datos!E8)","v":0},{"$f":"Datos!F8","v":0}]
[{"$f":"Datos!A9","v":"Geografía"},{"$f":"Datos!B9","v":0},"","1º ESO",{"$f":"Datos!C9","v":0},{"$f":"Datos!D9","v":0},{"$f":"IF(Datos!D9<>\"S\",Datos!F$1,Datos!E9)","v":0},{"$f":"Datos!F9","v":0}]
[{"$f":"Datos!A10","v":"Informática"},{"$f":"Datos!B10","v":0},"","1º ESO",{"$f":"Datos!C10","v":0},{"$f":"Datos!D10","v":0},{"$f":"IF(Datos!D10<>\"S\",Datos!F$1,Datos!E10)","v":0},{"$f":"Datos!F10","v":0}]
[{"$f":"Datos!A11","v":"Inglés"},{"$f":"Datos!B11","v":0},"","1º ESO",{"$f":"Datos!C11","v":0},{"$f":"Datos!D11","v":0},{"$f":"IF(Datos!D11<>\"S\",Datos!F$1,Datos!E11)","v":0},{"$f":"Datos!F11","v":0}]
[{"$f":"Datos!A12","v":"Lengua Cast"},{"$f":"Datos!B12","v":0},"","1º ESO",{"$f":"Datos!C12","v":0},{"$f":"Datos!D12","v":0},{"$f":"IF(Datos!D12<>\"S\",Datos!F$1,Datos!E12)","v":0},{"$f":"Datos!F12","v":0}]
[{"$f":"Datos!A13","v":"Matemáticas"},{"$f":"Datos!B13","v":0},"","1º ESO",{"$f":"Datos!C13","v":0},{"$f":"Datos!D13","v":0},{"$f":"IF(Datos!D13<>\"S\",Datos!F$1,Datos!E13)","v":0},{"$f":"Datos!F13","v":0}]
[{"$f":"Datos!A14","v":"Música"},{"$f":"Datos!B14","v":0},"","1º ESO",{"$f":"Datos!C14","v":0},{"$f":"Datos!D14","v":0},{"$f":"IF(Datos!D14<>\"S\",Datos!F$1,Datos!E14)","v":0},{"$f":"Datos!F14","v":0}]
[{"$f":"Datos!A15","v":"Tecnología"},{"$f":"Datos!B15","v":0},"","1º ESO",{"$f":"Datos!C15","v":0},{"$f":"Datos!D15","v":0},{"$f":"IF(Datos!D15<>\"S\",Datos!F$1,Datos!E15)","v":0},{"$f":"Datos!F15","v":0}]
[{"$f":"Datos!A16","v":"Taller Mat"},{"$f":"Datos!B16","v":0},"","1º ESO",{"$f":"Datos!C16","v":0},{"$f":"Datos!D16","v":0},{"$f":"IF(Datos!D16<>\"S\",Datos!F$1,Datos!E16)","v":0},{"$f":"Datos!F16","v":0}]
[{"$f":"Datos!A17","v":"taller Leng"},{"$f":"Datos!B17","v":0},"","1º ESO",{"$f":"Datos!C17","v":0},{"$f":"Datos!D17","v":0},{"$f":"IF(Datos!D17<>\"S\",Datos!F$1,Datos!E17)","v":0},{"$f":"Datos!F17","v":0}]
[{"$f":"Datos!A18","v":"Asign 1"},{"$f":"Datos!B18","v":0},"","1º ESO",{"$f":"Datos!C18","v":0},{"$f":"Datos!D18","v":0},{"$f":"IF(Datos!D18<>\"S\",Datos!F$1,Datos!E18)","v":0},{"$f":"Datos!F18","v":0}]
[{"$f":"Datos!A19","v":"Asign 2"},{"$f":"Datos!B19","v":0},"","1º ESO",{"$f":"Datos!C19","v":0},{"$f":"Datos!D19","v":0},{"$f":"IF(Datos!D19<>\"S\",Datos!F$1,Datos!E19)","v":0},{"$f":"Datos!F19","v":0}]
[{"$f":"Datos!A20","v":"Asign 3"},{"$f":"Datos!B20","v":0},"","1º ESO",{"$f":"Datos!C20","v":0},{"$f":"Datos!D20","v":0},{"$f":"IF(Datos!D20<>\"S\",Datos!F$1,Datos!E20)","v":0},{"$f":"Datos!F20","v":0}]
[{"$f":"Datos!A21","v":"Asign 4"},{"$f":"Datos!B21","v":0},"","1º ESO",{"$f":"Datos!C21","v":0},{"$f":"Datos!D21","v":0},{"$f":"IF(Datos!D21<>\"S\",Datos!F$1,Datos!E21)","v":0},{"$f":"Datos!F21","v":0}]
[{"$f":"Datos!A22","v":"Asign 5"},{"$f":"Datos!B22","v":0},"","1º ESO",{"$f":"Datos!C22","v":0},{"$f":"Datos!D22","v":0},{"$f":"IF(Datos!D22<>\"S\",Datos!F$1,Datos!E22)","v":0},{"$f":"Datos!F22","v":0}]
[{"$f":"Datos!A23","v":"Hist Relig"},{"$f":"Datos!B23","v":0},"","1º ESO",{"$f":"Datos!C23","v":0},{"$f":"Datos!D23","v":0},{"$f":"IF(Datos!D23<>\"S\",Datos!F$1,Datos!E23)","v":0},{"$f":"Datos!F23","v":0}]
[{"$f":"Datos!A24","v":"Ámbito CT"},{"$f":"Datos!B24","v":0},"","1º ESO",{"$f":"Datos!C24","v":0},{"$f":"Datos!D24","v":0},{"$f":"IF(Datos!D24<>\"S\",Datos!F$1,Datos!E24)","v":0},{"$f":"Datos!F24","v":0}]
[{"$f":"Datos!A25","v":"Ámbito SL"},{"$f":"Datos!B25","v":0},"","1º ESO",{"$f":"Datos!C25","v":0},{"$f":"Datos!D25","v":0},{"$f":"IF(Datos!D25<>\"S\",Datos!F$1,Datos!E25)","v":0},{"$f":"Datos!F25","v":0}]
[{"$f":"Datos!A26","v":"Economía"},{"$f":"Datos!B26","v":0},"","1º ESO",{"$f":"Datos!C26","v":0},{"$f":"Datos!D26","v":0},{"$f":"IF(Datos!D26<>\"S\",Datos!F$1,Datos!E26)","v":0},{"$f":"Datos!F26","v":0}]
[{"$f":"Datos!A27","v":"Ed Ciudadanía"},{"$f":"Datos!B27","v":0},"","1º ESO",{"$f":"Datos!C27","v":0},{"$f":"Datos!D27","v":0},{"$f":"IF(Datos!D27<>\"S\",Datos!F$1,Datos!E27)","v":0},{"$f":"Datos!F27","v":0}]
[{"$f":"Datos!A28","v":"Electrotecnia"},{"$f":"Datos!B28","v":0},"","1º ESO",{"$f":"Datos!C28","v":0},{"$f":"Datos!D28","v":0},{"$f":"IF(Datos!D28<>\"S\",Datos!F$1,Datos!E28)","v":0},{"$f":"Datos!F28","v":0}]
[{"$f":"Datos!A29","v":"Filosofía"},{"$f":"Datos!B29","v":0},"","1º ESO",{"$f":"Datos!C29","v":0},{"$f":"Datos!D29","v":0},{"$f":"IF(Datos!D29<>\"S\",Datos!F$1,Datos!E29)","v":0},{"$f":"Datos!F29","v":0}]
[{"$f":"Datos!A30","v":"Física "},{"$f":"Datos!B30","v":0},"","1º ESO",{"$f":"Datos!C30","v":0},{"$f":"Datos!D30","v":0},{"$f":"IF(Datos!D30<>\"S\",Datos!F$1,Datos!E30)","v":0},{"$f":"Datos!F30","v":0}]
[{"$f":"Datos!A31","v":"FOL"},{"$f":"Datos!B31","v":0},"","1º ESO",{"$f":"Datos!C31","v":0},{"$f":"Datos!D31","v":0},{"$f":"IF(Datos!D31<>\"S\",Datos!F$1,Datos!E31)","v":0},{"$f":"Datos!F31","v":0}]
[{"$f":"Datos!A32","v":"Fundamentos"},{"$f":"Datos!B32","v":0},"","1º ESO",{"$f":"Datos!C32","v":0},{"$f":"Datos!D32","v":0},{"$f":"IF(Datos!D32<>\"S\",Datos!F$1,Datos!E32)","v":0},{"$f":"Datos!F32","v":0}]
[{"$f":"Datos!A33","v":"Geología"},{"$f":"Datos!B33","v":0},"","1º ESO",{"$f":"Datos!C33","v":0},{"$f":"Datos!D33","v":0},{"$f":"IF(Datos!D33<>\"S\",Datos!F$1,Datos!E33)","v":0},{"$f":"Datos!F33","v":0}]
[{"$f":"Datos!A34","v":"Griego"},{"$f":"Datos!B34","v":0},"","1º ESO",{"$f":"Datos!C34","v":0},{"$f":"Datos!D34","v":0},{"$f":"IF(Datos!D34<>\"S\",Datos!F$1,Datos!E34)","v":0},{"$f":"Datos!F34","v":0}]
[{"$f":"Datos!A35","v":"Historia"},{"$f":"Datos!B35","v":0},"","1º ESO",{"$f":"Datos!C35","v":0},{"$f":"Datos!D35","v":0},{"$f":"IF(Datos!D35<>\"S\",Datos!F$1,Datos!E35)","v":0},{"$f":"Datos!F35","v":0}]
[{"$f":"Datos!A36","v":"Historia Arte"},{"$f":"Datos!B36","v":0},"","1º ESO",{"$f":"Datos!C36","v":0},{"$f":"Datos!D36","v":0},{"$f":"IF(Datos!D36<>\"S\",Datos!F$1,Datos!E36)","v":0},{"$f":"Datos!F36","v":0}]
[{"$f":"Datos!A37","v":"Inglés Profes"},{"$f":"Datos!B37","v":0},"","1º ESO",{"$f":"Datos!C37","v":0},{"$f":"Datos!D37","v":0},{"$f":"IF(Datos!D37<>\"S\",Datos!F$1,Datos!E37)","v":0},{"$f":"Datos!F37","v":0}]
[{"$f":"Datos!A38","v":"Latín"},{"$f":"Datos!B38","v":0},"","1º ESO",{"$f":"Datos!C38","v":0},{"$f":"Datos!D38","v":0},{"$f":"IF(Datos!D38<>\"S\",Datos!F$1,Datos!E38)","v":0},{"$f":"Datos!F38","v":0}]
[{"$f":"Datos!A39","v":"Literatura"},{"$f":"Datos!B39","v":0},"","1º ESO",{"$f":"Datos!C39","v":0},{"$f":"Datos!D39","v":0},{"$f":"IF(Datos!D39<>\"S\",Datos!F$1,Datos!E39)","v":0},{"$f":"Datos!F39","v":0}]
[{"$f":"Datos!A40","v":"Mecánica"},{"$f":"Datos!B40","v":0},"","1º ESO",{"$f":"Datos!C40","v":0},{"$f":"Datos!D40","v":0},{"$f":"IF(Datos!D40<>\"S\",Datos!F$1,Datos!E40)","v":0},{"$f":"Datos!F40","v":0}]
[{"$f":"Datos!A41","v":"Psicología"},{"$f":"Datos!B41","v":0},"","1º ESO",{"$f":"Datos!C41","v":0},{"$f":"Datos!D41","v":0},{"$f":"IF(Datos!D41<>\"S\",Datos!F$1,Datos!E41)","v":0},{"$f":"Datos!F41","v":0}]
[{"$f":"Datos!A42","v":"Química"},{"$f":"Datos!B42","v":0},"","1º ESO",{"$f":"Datos!C42","v":0},{"$f":"Datos!D42","v":0},{"$f":"IF(Datos!D42<>\"S\",Datos!F$1,Datos!E42)","v":0},{"$f":"Datos!F42","v":0}]
[{"$f":"Datos!A3","v":"Biología"},{"$f":"Datos!B3","v":0},"","2º ESO",{"$f":"Datos!G3","v":0},{"$f":"Datos!H3","v":0},{"$f":"IF(Datos!H3<>\"S\",Datos!J$1,Datos!I3)","v":0},{"$f":"Datos!J3","v":0}]
[{"$f":"Datos!A4","v":"Dibujo"},{"$f":"Datos!B4","v":0},"","2º ESO",{"$f":"Datos!G4","v":0},{"$f":"Datos!H4","v":0},{"$f":"IF(Datos!H4<>\"S\",Datos!J$1,Datos!I4)","v":0},{"$f":"Datos!J4","v":0}]
[{"$f":"Datos!A5","v":"Ed Fisica"},{"$f":"Datos!B5","v":0},"","2º ESO",{"$f":"Datos!G5","v":0},{"$f":"Datos!H5","v":0},{"$f":"IF(Datos!H5<>\"S\",Datos!J$1,Datos!I5)","v":0},{"$f":"Datos!J5","v":0}]
[{"$f":"Datos!A6","v":"Ética"},{"$f":"Datos!B6","v":0},"","2º ESO",{"$f":"Datos!G6","v":0},{"$f":"Datos!H6","v":0},{"$f":"IF(Datos!H6<>\"S\",Datos!J$1,Datos!I6)","v":0},{"$f":"Datos!J6","v":0}]
[{"$f":"Datos!A7","v":"Física y Quím"},{"$f":"Datos!B7","v":0},"","2º ESO",{"$f":"Datos!G7","v":0},{"$f":"Datos!H7","v":0},{"$f":"IF(Datos!H7<>\"S\",Datos!J$1,Datos!I7)","v":0},{"$f":"Datos!J7","v":0}]
[{"$f":"Datos!A8","v":"Francés"},{"$f":"Datos!B8","v":0},"","2º ESO",{"$f":"Datos!G8","v":0},{"$f":"Datos!H8","v":0},{"$f":"IF(Datos!H8<>\"S\",Datos!J$1,Datos!I8)","v":0},{"$f":"Datos!J8","v":0}]
[{"$f":"Datos!A9","v":"Geografía"},{"$f":"Datos!B9","v":0},"","2º ESO",{"$f":"Datos!G9","v":0},{"$f":"Datos!H9","v":0},{"$f":"IF(Datos!H9<>\"S\",Datos!J$1,Datos!I9)","v":0},{"$f":"Datos!J9","v":0}]
[{"$f":"Datos!A10","v":"Informática"},{"$f":"Datos!B10","v":0},"","2º ESO",{"$f":"Datos!G10","v":0},{"$f":"Datos!H10","v":0},{"$f":"IF(Datos!H10<>\"S\",Datos!J$1,Datos!I10)","v":0},{"$f":"Datos!J10","v":0}]
[{"$f":"Datos!A11","v":"Inglés"},{"$f":"Datos!B11","v":0},"","2º ESO",{"$f":"Datos!G11","v":0},{"$f":"Datos!H11","v":0},{"$f":"IF(Datos!H11<>\"S\",Datos!J$1,Datos!I11)","v":0},{"$f":"Datos!J11","v":0}]
[{"$f":"Datos!A12","v":"Lengua Cast"},{"$f":"Datos!B12","v":0},"","2º ESO",{"$f":"Datos!G12","v":0},{"$f":"Datos!H12","v":0},{"$f":"IF(Datos!H12<>\"S\",Datos!J$1,Datos!I12)","v":0},{"$f":"Datos!J12","v":0}]
[{"$f":"Datos!A13","v":"Matemáticas"},{"$f":"Datos!B13","v":0},"","2º ESO",{"$f":"Datos!G13","v":0},{"$f":"Datos!H13","v":0},{"$f":"IF(Datos!H13<>\"S\",Datos!J$1,Datos!I13)","v":0},{"$f":"Datos!J13","v":0}]
[{"$f":"Datos!A14","v":"Música"},{"$f":"Datos!B14","v":0},"","2º ESO",{"$f":"Datos!G14","v":0},{"$f":"Datos!H14","v":0},{"$f":"IF(Datos!H14<>\"S\",Datos!J$1,Datos!I14)","v":0},{"$f":"Datos!J14","v":0}]
[{"$f":"Datos!A15","v":"Tecnología"},{"$f":"Datos!B15","v":0},"","2º ESO",{"$f":"Datos!G15","v":0},{"$f":"Datos!H15","v":0},{"$f":"IF(Datos!H15<>\"S\",Datos!J$1,Datos!I15)","v":0},{"$f":"Datos!J15","v":0}]
[{"$f":"Datos!A16","v":"Taller Mat"},{"$f":"Datos!B16","v":0},"","2º ESO",{"$f":"Datos!G16","v":0},{"$f":"Datos!H16","v":0},{"$f":"IF(Datos!H16<>\"S\",Datos!J$1,Datos!I16)","v":0},{"$f":"Datos!J16","v":0}]
[{"$f":"Datos!A17","v":"taller Leng"},{"$f":"Datos!B17","v":0},"","2º ESO",{"$f":"Datos!G17","v":0},{"$f":"Datos!H17","v":0},{"$f":"IF(Datos!H17<>\"S\",Datos!J$1,Datos!I17)","v":0},{"$f":"Datos!J17","v":0}]
[{"$f":"Datos!A18","v":"Asign 1"},{"$f":"Datos!B18","v":0},"","2º ESO",{"$f":"Datos!G18","v":0},{"$f":"Datos!H18","v":0},{"$f":"IF(Datos!H18<>\"S\",Datos!J$1,Datos!I18)","v":0},{"$f":"Datos!J18","v":0}]
[{"$f":"Datos!A19","v":"Asign 2"},{"$f":"Datos!B19","v":0},"","2º ESO",{"$f":"Datos!G19","v":0},{"$f":"Datos!H19","v":0},{"$f":"IF(Datos!H19<>\"S\",Datos!J$1,Datos!I19)","v":0},{"$f":"Datos!J19","v":0}]
[{"$f":"Datos!A20","v":"Asign 3"},{"$f":"Datos!B20","v":0},"","2º ESO",{"$f":"Datos!G20","v":0},{"$f":"Datos!H20","v":0},{"$f":"IF(Datos!H20<>\"S\",Datos!J$1,Datos!I20)","v":0},{"$f":"Datos!J20","v":0}]
[{"$f":"Datos!A21","v":"Asign 4"},{"$f":"Datos!B21","v":0},"","2º ESO",{"$f":"Datos!G21","v":0},{"$f":"Datos!H21","v":0},{"$f":"IF(Datos!H21<>\"S\",Datos!J$1,Datos!I21)","v":0},{"$f":"Datos!J21","v":0}]
[{"$f":"Datos!A22","v":"Asign 5"},{"$f":"Datos!B22","v":0},"","2º ESO",{"$f":"Datos!G22","v":0},{"$f":"Datos!H22","v":0},{"$f":"IF(Datos!H22<>\"S\",Datos!J$1,Datos!I22)","v":0},{"$f":"Datos!J22","v":0}]
[{"$f":"Datos!A23","v":"Hist Relig"},{"$f":"Datos!B23","v":0},"","2º ESO",{"$f":"Datos!G23","v":0},{"$f":"Datos!H23","v":0},{"$f":"IF(Datos!H23<>\"S\",Datos!J$1,Datos!I23)","v":0},{"$f":"Datos!J23","v":0}]
[{"$f":"Datos!A24","v":"Ámbito CT"},{"$f":"Datos!B24","v":0},"","2º ESO",{"$f":"Datos!G24","v":0},{"$f":"Datos!H24","v":0},{"$f":"IF(Datos!H24<>\"S\",Datos!J$1,Datos!I24)","v":0},{"$f":"Datos!J24","v":0}]
[{"$f":"Datos!A25","v":"Ámbito SL"},{"$f":"Datos!B25","v":0},"","2º ESO",{"$f":"Datos!G25","v":0},{"$f":"Datos!H25","v":0},{"$f":"IF(Datos!H25<>\"S\",Datos!J$1,Datos!I25)","v":0},{"$f":"Datos!J25","v":0}]
[{"$f":"Datos!A26","v":"Economía"},{"$f":"Datos!B26","v":0},"","2º ESO",{"$f":"Datos!G26","v":0},{"$f":"Datos!H26","v":0},{"$f":"IF(Datos!H26<>\"S\",Datos!J$1,Datos!I26)","v":0},{"$f":"Datos!J26","v":0}]
[{"$f":"Datos!A27","v":"Ed Ciudadanía"},{"$f":"Datos!B27","v":0},"","2º ESO",{"$f":"Datos!G27","v":0},{"$f":"Datos!H27","v":0},{"$f":"IF(Datos!H27<>\"S\",Datos!J$1,Datos!I27)","v":0},{"$f":"Datos!J27","v":0}]
[{"$f":"Datos!A28","v":"Electrotecnia"},{"$f":"Datos!B28","v":0},{"$f":"IF(H68<>0,B68,\"\")","v":""},"2º ESO",{"$f":"Datos!G28","v":0},{"$f":"Datos!H28","v":0},{"$f":"IF(Datos!H28<>\"S\",Datos!J$1,Datos!I28)","v":0},{"$f":"Datos!J28","v":0}]
[{"$f":"Datos!A29","v":"Filosofía"},{"$f":"Datos!B29","v":0},"","2º ESO",{"$f":"Datos!G29","v":0},{"$f":"Datos!H29","v":0},{"$f":"IF(Datos!H29<>\"S\",Datos!J$1,Datos!I29)","v":0},{"$f":"Datos!J29","v":0}]
[{"$f":"Datos!A30","v":"Física "},{"$f":"Datos!B30","v":0},"","2º ESO",{"$f":"Datos!G30","v":0},{"$f":"Datos!H30","v":0},{"$f":"IF(Datos!H30<>\"S\",Datos!J$1,Datos!I30)","v":0},{"$f":"Datos!J30","v":0}]
[{"$f":"Datos!A31","v":"FOL"},{"$f":"Datos!B31","v":0},"","2º ESO",{"$f":"Datos!G31","v":0},{"$f":"Datos!H31","v":0},{"$f":"IF(Datos!H31<>\"S\",Datos!J$1,Datos!I31)","v":0},{"$f":"Datos!J31","v":0}]
[{"$f":"Datos!A32","v":"Fundamentos"},{"$f":"Datos!B32","v":0},"","2º ESO",{"$f":"Datos!G32","v":0},{"$f":"Datos!H32","v":0},{"$f":"IF(Datos!H32<>\"S\",Datos!J$1,Datos!I32)","v":0},{"$f":"Datos!J32","v":0}]
[{"$f":"Datos!A33","v":"Geología"},{"$f":"Datos!B33","v":0},"","2º ESO",{"$f":"Datos!G33","v":0},{"$f":"Datos!H33","v":0},{"$f":"IF(Datos!H33<>\"S\",Datos!J$1,Datos!I33)","v":0},{"$f":"Datos!J33","v":0}]
[{"$f":"Datos!A34","v":"Griego"},{"$f":"Datos!B34","v":0},"","2º ESO",{"$f":"Datos!G34","v":0},{"$f":"Datos!H34","v":0},{"$f":"IF(Datos!H34<>\"S\",Datos!J$1,Datos!I34)","v":0},{"$f":"Datos!J34","v":0}]
[{"$f":"Datos!A35","v":"Historia"},{"$f":"Datos!B35","v":0},"","2º ESO",{"$f":"Datos!G35","v":0},{"$f":"Datos!H35","v":0},{"$f":"IF(Datos!H35<>\"S\",Datos!J$1,Datos!I35)","v":0},{"$f":"Datos!J35","v":0}]
[{"$f":"Datos!A36","v":"Historia Arte"},{"$f":"Datos!B36","v":0},"","2º ESO",{"$f":"Datos!G36","v":0},{"$f":"Datos!H36","v":0},{"$f":"IF(Datos!H36<>\"S\",Datos!J$1,Datos!I36)","v":0},{"$f":"Datos!J36","v":0}]
[{"$f":"Datos!A37","v":"Inglés Profes"},{"$f":"Datos!B37","v":0},"","2º ESO",{"$f":"Datos!G37","v":0},{"$f":"Datos!H37","v":0},{"$f":"IF(Datos!H37<>\"S\",Datos!J$1,Datos!I37)","v":0},{"$f":"Datos!J37","v":0}]
[{"$f":"Datos!A38","v":"Latín"},{"$f":"Datos!B38","v":0},"","2º ESO",{"$f":"Datos!G38","v":0},{"$f":"Datos!H38","v":0},{"$f":"IF(Datos!H38<>\"S\",Datos!J$1,Datos!I38)","v":0},{"$f":"Datos!J38","v":0}]
[{"$f":"Datos!A39","v":"Literatura"},{"$f":"Datos!B39","v":0},"","2º ESO",{"$f":"Datos!G39","v":0},{"$f":"Datos!H39","v":0},{"$f":"IF(Datos!H39<>\"S\",Datos!J$1,Datos!I39)","v":0},{"$f":"Datos!J39","v":0}]
[{"$f":"Datos!A40","v":"Mecánica"},{"$f":"Datos!B40","v":0},"","2º ESO",{"$f":"Datos!G40","v":0},{"$f":"Datos!H40","v":0},{"$f":"IF(Datos!H40<>\"S\",Datos!J$1,Datos!I40)","v":0},{"$f":"Datos!J40","v":0}]
[{"$f":"Datos!A41","v":"Psicología"},{"$f":"Datos!B41","v":0},"","2º ESO",{"$f":"Datos!G41","v":0},{"$f":"Datos!H41","v":0},{"$f":"IF(Datos!H41<>\"S\",Datos!J$1,Datos!I41)","v":0},{"$f":"Datos!J41","v":0}]
[{"$f":"Datos!A42","v":"Química"},{"$f":"Datos!B42","v":0},"","2º ESO",{"$f":"Datos!G42","v":0},{"$f":"Datos!H42","v":0},{"$f":"IF(Datos!H42<>\"S\",Datos!J$1,Datos!I42)","v":0},{"$f":"Datos!J42","v":0}]
[{"$f":"Datos!A3","v":"Biología"},{"$f":"Datos!B3","v":0},"","3º ESO",{"$f":"Datos!K3","v":0},{"$f":"Datos!L3","v":0},{"$f":"IF(Datos!L3<>\"S\",Datos!N$1,Datos!M3)","v":0},{"$f":"Datos!N3","v":0}]
[{"$f":"Datos!A4","v":"Dibujo"},{"$f":"Datos!B4","v":0},"","3º ESO",{"$f":"Datos!K4","v":0},{"$f":"Datos!L4","v":0},{"$f":"IF(Datos!L4<>\"S\",Datos!N$1,Datos!M4)","v":0},{"$f":"Datos!N4","v":0}]
[{"$f":"Datos!A5","v":"Ed Fisica"},{"$f":"Datos!B5","v":0},"","3º ESO",{"$f":"Datos!K5","v":0},{"$f":"Datos!L5","v":0},{"$f":"IF(Datos!L5<>\"S\",Datos!N$1,Datos!M5)","v":0},{"$f":"Datos!N5","v":0}]
[{"$f":"Datos!A6","v":"Ética"},{"$f":"Datos!B6","v":0},"","3º ESO",{"$f":"Datos!K6","v":0},{"$f":"Datos!L6","v":0},{"$f":"IF(Datos!L6<>\"S\",Datos!N$1,Datos!M6)","v":0},{"$f":"Datos!N6","v":0}]
[{"$f":"Datos!A7","v":"Física y Quím"},{"$f":"Datos!B7","v":0},"","3º ESO",{"$f":"Datos!K7","v":0},{"$f":"Datos!L7","v":0},{"$f":"IF(Datos!L7<>\"S\",Datos!N$1,Datos!M7)","v":0},{"$f":"Datos!N7","v":0}]
[{"$f":"Datos!A8","v":"Francés"},{"$f":"Datos!B8","v":0},"","3º ESO",{"$f":"Datos!K8","v":0},{"$f":"Datos!L8","v":0},{"$f":"IF(Datos!L8<>\"S\",Datos!N$1,Datos!M8)","v":0},{"$f":"Datos!N8","v":0}]
[{"$f":"Datos!A9","v":"Geografía"},{"$f":"Datos!B9","v":0},"","3º ESO",{"$f":"Datos!K9","v":0},{"$f":"Datos!L9","v":0},{"$f":"IF(Datos!L9<>\"S\",Datos!N$1,Datos!M9)","v":0},{"$f":"Datos!N9","v":0}]
[{"$f":"Datos!A10","v":"Informática"},{"$f":"Datos!B10","v":0},"","3º ESO",{"$f":"Datos!K10","v":0},{"$f":"Datos!L10","v":0},{"$f":"IF(Datos!L10<>\"S\",Datos!N$1,Datos!M10)","v":0},{"$f":"Datos!N10","v":0}]
[{"$f":"Datos!A11","v":"Inglés"},{"$f":"Datos!B11","v":0},"","3º ESO",{"$f":"Datos!K11","v":0},{"$f":"Datos!L11","v":0},{"$f":"IF(Datos!L11<>\"S\",Datos!N$1,Datos!M11)","v":0},{"$f":"Datos!N11","v":0}]
[{"$f":"Datos!A12","v":"Lengua Cast"},{"$f":"Datos!B12","v":0},"","3º ESO",{"$f":"Datos!K12","v":0},{"$f":"Datos!L12","v":0},{"$f":"IF(Datos!L12<>\"S\",Datos!N$1,Datos!M12)","v":0},{"$f":"Datos!N12","v":0}]
[{"$f":"Datos!A13","v":"Matemáticas"},{"$f":"Datos!B13","v":0},"","3º ESO",{"$f":"Datos!K13","v":0},{"$f":"Datos!L13","v":0},{"$f":"IF(Datos!L13<>\"S\",Datos!N$1,Datos!M13)","v":0},{"$f":"Datos!N13","v":0}]
[{"$f":"Datos!A14","v":"Música"},{"$f":"Datos!B14","v":0},"","3º ESO",{"$f":"Datos!K14","v":0},{"$f":"Datos!L14","v":0},{"$f":"IF(Datos!L14<>\"S\",Datos!N$1,Datos!M14)","v":0},{"$f":"Datos!N14","v":0}]
[{"$f":"Datos!A15","v":"Tecnología"},{"$f":"Datos!B15","v":0},"","3º ESO",{"$f":"Datos!K15","v":0},{"$f":"Datos!L15","v":0},{"$f":"IF(Datos!L15<>\"S\",Datos!N$1,Datos!M15)","v":0},{"$f":"Datos!N15","v":0}]
[{"$f":"Datos!A16","v":"Taller Mat"},{"$f":"Datos!B16","v":0},"","3º ESO",{"$f":"Datos!K16","v":0},{"$f":"Datos!L16","v":0},{"$f":"IF(Datos!L16<>\"S\",Datos!N$1,Datos!M16)","v":0},{"$f":"Datos!N16","v":0}]
[{"$f":"Datos!A17","v":"taller Leng"},{"$f":"Datos!B17","v":0},"","3º ESO",{"$f":"Datos!K17","v":0},{"$f":"Datos!L17","v":0},{"$f":"IF(Datos!L17<>\"S\",Datos!N$1,Datos!M17)","v":0},{"$f":"Datos!N17","v":0}]
[{"$f":"Datos!A18","v":"Asign 1"},{"$f":"Datos!B18","v":0},"","3º ESO",{"$f":"Datos!K18","v":0},{"$f":"Datos!L18","v":0},{"$f":"IF(Datos!L18<>\"S\",Datos!N$1,Datos!M18)","v":0},{"$f":"Datos!N18","v":0}]
[{"$f":"Datos!A19","v":"Asign 2"},{"$f":"Datos!B19","v":0},"","3º ESO",{"$f":"Datos!K19","v":0},{"$f":"Datos!L19","v":0},{"$f":"IF(Datos!L19<>\"S\",Datos!N$1,Datos!M19)","v":0},{"$f":"Datos!N19","v":0}]
[{"$f":"Datos!A20","v":"Asign 3"},{"$f":"Datos!B20","v":0},"","3º ESO",{"$f":"Datos!K20","v":0},{"$f":"Datos!L20","v":0},{"$f":"IF(Datos!L20<>\"S\",Datos!N$1,Datos!M20)","v":0},{"$f":"Datos!N20","v":0}]
[{"$f":"Datos!A21","v":"Asign 4"},{"$f":"Datos!B21","v":0},"","3º ESO",{"$f":"Datos!K21","v":0},{"$f":"Datos!L21","v":0},{"$f":"IF(Datos!L21<>\"S\",Datos!N$1,Datos!M21)","v":0},{"$f":"Datos!N21","v":0}]
[{"$f":"Datos!A22","v":"Asign 5"},{"$f":"Datos!B22","v":0},"","3º ESO",{"$f":"Datos!K22","v":0},{"$f":"Datos!L22","v":0},{"$f":"IF(Datos!L22<>\"S\",Datos!N$1,Datos!M22)","v":0},{"$f":"Datos!N22","v":0}]
[{"$f":"Datos!A23","v":"Hist Relig"},{"$f":"Datos!B23","v":0},"","3º ESO",{"$f":"Datos!K23","v":0},{"$f":"Datos!L23","v":0},{"$f":"IF(Datos!L23<>\"S\",Datos!N$1,Datos!M23)","v":0},{"$f":"Datos!N23","v":0}]
[{"$f":"Datos!A24","v":"Ámbito CT"},{"$f":"Datos!B24","v":0},"","3º ESO",{"$f":"Datos!K24","v":0},{"$f":"Datos!L24","v":0},{"$f":"IF(Datos!L24<>\"S\",Datos!N$1,Datos!M24)","v":0},{"$f":"Datos!N24","v":0}]
[{"$f":"Datos!A25","v":"Ámbito SL"},{"$f":"Datos!B25","v":0},"","3º ESO",{"$f":"Datos!K25","v":0},{"$f":"Datos!L25","v":0},{"$f":"IF(Datos!L25<>\"S\",Datos!N$1,Datos!M25)","v":0},{"$f":"Datos!N25","v":0}]
[{"$f":"Datos!A26","v":"Economía"},{"$f":"Datos!B26","v":0},"","3º ESO",{"$f":"Datos!K26","v":0},{"$f":"Datos!L26","v":0},{"$f":"IF(Datos!L26<>\"S\",Datos!N$1,Datos!M26)","v":0},{"$f":"Datos!N26","v":0}]
[{"$f":"Datos!A27","v":"Ed Ciudadanía"},{"$f":"Datos!B27","v":0},"","3º ESO",{"$f":"Datos!K27","v":0},{"$f":"Datos!L27","v":0},{"$f":"IF(Datos!L27<>\"S\",Datos!N$1,Datos!M27)","v":0},{"$f":"Datos!N27","v":0}]
[{"$f":"Datos!A28","v":"Electrotecnia"},{"$f":"Datos!B28","v":0},"","3º ESO",{"$f":"Datos!K28","v":0},{"$f":"Datos!L28","v":0},{"$f":"IF(Datos!L28<>\"S\",Datos!N$1,Datos!M28)","v":0},{"$f":"Datos!N28","v":0}]
[{"$f":"Datos!A29","v":"Filosofía"},{"$f":"Datos!B29","v":0},"","3º ESO",{"$f":"Datos!K29","v":0},{"$f":"Datos!L29","v":0},{"$f":"IF(Datos!L29<>\"S\",Datos!N$1,Datos!M29)","v":0},{"$f":"Datos!N29","v":0}]
[{"$f":"Datos!A30","v":"Física "},{"$f":"Datos!B30","v":0},"","3º ESO",{"$f":"Datos!K30","v":0},{"$f":"Datos!L30","v":0},{"$f":"IF(Datos!L30<>\"S\",Datos!N$1,Datos!M30)","v":0},{"$f":"Datos!N30","v":0}]
[{"$f":"Datos!A31","v":"FOL"},{"$f":"Datos!B31","v":0},"","3º ESO",{"$f":"Datos!K31","v":0},{"$f":"Datos!L31","v":0},{"$f":"IF(Datos!L31<>\"S\",Datos!N$1,Datos!M31)","v":0},{"$f":"Datos!N31","v":0}]
[{"$f":"Datos!A32","v":"Fundamentos"},{"$f":"Datos!B32","v":0},"","3º ESO",{"$f":"Datos!K32","v":0},{"$f":"Datos!L32","v":0},{"$f":"IF(Datos!L32<>\"S\",Datos!N$1,Datos!M32)","v":0},{"$f":"Datos!N32","v":0}]
[{"$f":"Datos!A33","v":"Geología"},{"$f":"Datos!B33","v":0},"","3º ESO",{"$f":"Datos!K33","v":0},{"$f":"Datos!L33","v":0},{"$f":"IF(Datos!L33<>\"S\",Datos!N$1,Datos!M33)","v":0},{"$f":"Datos!N33","v":0}]
[{"$f":"Datos!A34","v":"Griego"},{"$f":"Datos!B34","v":0},"","3º ESO",{"$f":"Datos!K34","v":0},{"$f":"Datos!L34","v":0},{"$f":"IF(Datos!L34<>\"S\",Datos!N$1,Datos!M34)","v":0},{"$f":"Datos!N34","v":0}]
[{"$f":"Datos!A35","v":"Historia"},{"$f":"Datos!B35","v":0},"","3º ESO",{"$f":"Datos!K35","v":0},{"$f":"Datos!L35","v":0},{"$f":"IF(Datos!L35<>\"S\",Datos!N$1,Datos!M35)","v":0},{"$f":"Datos!N35","v":0}]
[{"$f":"Datos!A36","v":"Historia Arte"},{"$f":"Datos!B36","v":0},"","3º ESO",{"$f":"Datos!K36","v":0},{"$f":"Datos!L36","v":0},{"$f":"IF(Datos!L36<>\"S\",Datos!N$1,Datos!M36)","v":0},{"$f":"Datos!N36","v":0}]
[{"$f":"Datos!A37","v":"Inglés Profes"},{"$f":"Datos!B37","v":0},"","3º ESO",{"$f":"Datos!K37","v":0},{"$f":"Datos!L37","v":0},{"$f":"IF(Datos!L37<>\"S\",Datos!N$1,Datos!M37)","v":0},{"$f":"Datos!N37","v":0}]
[{"$f":"Datos!A38","v":"Latín"},{"$f":"Datos!B38","v":0},"","3º ESO",{"$f":"Datos!K38","v":0},{"$f":"Datos!L38","v":0},{"$f":"IF(Datos!L38<>\"S\",Datos!N$1,Datos!M38)","v":0},{"$f":"Datos!N38","v":0}]
[{"$f":"Datos!A39","v":"Literatura"},{"$f":"Datos!B39","v":0},"","3º ESO",{"$f":"Datos!K39","v":0},{"$f":"Datos!L39","v":0},{"$f":"IF(Datos!L39<>\"S\",Datos!N$1,Datos!M39)","v":0},{"$f":"Datos!N39","v":0}]
[{"$f":"Datos!A40","v":"Mecánica"},{"$f":"Datos!B40","v":0},"","3º ESO",{"$f":"Datos!K40","v":0},{"$f":"Datos!L40","v":0},{"$f":"IF(Datos!L40<>\"S\",Datos!N$1,Datos!M40)","v":0},{"$f":"Datos!N40","v":0}]
[{"$f":"Datos!A41","v":"Psicología"},{"$f":"Datos!B41","v":0},"","3º ESO",{"$f":"Datos!K41","v":0},{"$f":"Datos!L41","v":0},{"$f":"IF(Datos!L41<>\"S\",Datos!N$1,Datos!M41)","v":0},{"$f":"Datos!N41","v":0}]
[{"$f":"Datos!A42","v":"Química"},{"$f":"Datos!B42","v":0},"","3º ESO",{"$f":"Datos!K42","v":0},{"$f":"Datos!L42","v":0},{"$f":"IF(Datos!L42<>\"S\",Datos!N$1,Datos!M42)","v":0},{"$f":"Datos!N42","v":0}]
[{"$f":"Datos!A3","v":"Biología"},{"$f":"Datos!B3","v":0},"","4º ESO",{"$f":"Datos!O3","v":0},{"$f":"Datos!P3","v":0},{"$f":"IF(Datos!P3<>\"S\",Datos!R$1,Datos!Q3)","v":0},{"$f":"Datos!R3","v":0}]
[{"$f":"Datos!A4","v":"Dibujo"},{"$f":"Datos!B4","v":0},"","4º ESO",{"$f":"Datos!O4","v":0},{"$f":"Datos!P4","v":0},{"$f":"IF(Datos!P4<>\"S\",Datos!R$1,Datos!Q4)","v":0},{"$f":"Datos!R4","v":0}]
[{"$f":"Datos!A5","v":"Ed Fisica"},{"$f":"Datos!B5","v":0},"","4º ESO",{"$f":"Datos!O5","v":0},{"$f":"Datos!P5","v":0},{"$f":"IF(Datos!P5<>\"S\",Datos!R$1,Datos!Q5)","v":0},{"$f":"Datos!R5","v":0}]
[{"$f":"Datos!A6","v":"Ética"},{"$f":"Datos!B6","v":0},"","4º ESO",{"$f":"Datos!O6","v":0},{"$f":"Datos!P6","v":0},{"$f":"IF(Datos!P6<>\"S\",Datos!R$1,Datos!Q6)","v":0},{"$f":"Datos!R6","v":0}]
[{"$f":"Datos!A7","v":"Física y Quím"},{"$f":"Datos!B7","v":0},"","4º ESO",{"$f":"Datos!O7","v":0},{"$f":"Datos!P7","v":0},{"$f":"IF(Datos!P7<>\"S\",Datos!R$1,Datos!Q7)","v":0},{"$f":"Datos!R7","v":0}]
[{"$f":"Datos!A8","v":"Francés"},{"$f":"Datos!B8","v":0},"","4º ESO",{"$f":"Datos!O8","v":0},{"$f":"Datos!P8","v":0},{"$f":"IF(Datos!P8<>\"S\",Datos!R$1,Datos!Q8)","v":0},{"$f":"Datos!R8","v":0}]
[{"$f":"Datos!A9","v":"Geografía"},{"$f":"Datos!B9","v":0},"","4º ESO",{"$f":"Datos!O9","v":0},{"$f":"Datos!P9","v":0},{"$f":"IF(Datos!P9<>\"S\",Datos!R$1,Datos!Q9)","v":0},{"$f":"Datos!R9","v":0}]
[{"$f":"Datos!A10","v":"Informática"},{"$f":"Datos!B10","v":0},"","4º ESO",{"$f":"Datos!O10","v":0},{"$f":"Datos!P10","v":0},{"$f":"IF(Datos!P10<>\"S\",Datos!R$1,Datos!Q10)","v":0},{"$f":"Datos!R10","v":0}]
[{"$f":"Datos!A11","v":"Inglés"},{"$f":"Datos!B11","v":0},"","4º ESO",{"$f":"Datos!O11","v":0},{"$f":"Datos!P11","v":0},{"$f":"IF(Datos!P11<>\"S\",Datos!R$1,Datos!Q11)","v":0},{"$f":"Datos!R11","v":0}]
[{"$f":"Datos!A12","v":"Lengua Cast"},{"$f":"Datos!B12","v":0},{"$f":"IF(H132<>0,B132,\"\")","v":""},"4º ESO",{"$f":"Datos!O12","v":0},{"$f":"Datos!P12","v":0},{"$f":"IF(Datos!P12<>\"S\",Datos!R$1,Datos!Q12)","v":0},{"$f":"Datos!R12","v":0}]
[{"$f":"Datos!A13","v":"Matemáticas"},{"$f":"Datos!B13","v":0},"","4º ESO",{"$f":"Datos!O13","v":0},{"$f":"Datos!P13","v":0},{"$f":"IF(Datos!P13<>\"S\",Datos!R$1,Datos!Q13)","v":0},{"$f":"Datos!R13","v":0}]
[{"$f":"Datos!A14","v":"Música"},{"$f":"Datos!B14","v":0},"","4º ESO",{"$f":"Datos!O14","v":0},{"$f":"Datos!P14","v":0},{"$f":"IF(Datos!P14<>\"S\",Datos!R$1,Datos!Q14)","v":0},{"$f":"Datos!R14","v":0}]
[{"$f":"Datos!A15","v":"Tecnología"},{"$f":"Datos!B15","v":0},"","4º ESO",{"$f":"Datos!O15","v":0},{"$f":"Datos!P15","v":0},{"$f":"IF(Datos!P15<>\"S\",Datos!R$1,Datos!Q15)","v":0},{"$f":"Datos!R15","v":0}]
[{"$f":"Datos!A16","v":"Taller Mat"},{"$f":"Datos!B16","v":0},"","4º ESO",{"$f":"Datos!O16","v":0},{"$f":"Datos!P16","v":0},{"$f":"IF(Datos!P16<>\"S\",Datos!R$1,Datos!Q16)","v":0},{"$f":"Datos!R16","v":0}]
[{"$f":"Datos!A17","v":"taller Leng"},{"$f":"Datos!B17","v":0},"","4º ESO",{"$f":"Datos!O17","v":0},{"$f":"Datos!P17","v":0},{"$f":"IF(Datos!P17<>\"S\",Datos!R$1,Datos!Q17)","v":0},{"$f":"Datos!R17","v":0}]
[{"$f":"Datos!A18","v":"Asign 1"},{"$f":"Datos!B18","v":0},"","4º ESO",{"$f":"Datos!O18","v":0},{"$f":"Datos!P18","v":0},{"$f":"IF(Datos!P18<>\"S\",Datos!R$1,Datos!Q18)","v":0},{"$f":"Datos!R18","v":0}]
[{"$f":"Datos!A19","v":"Asign 2"},{"$f":"Datos!B19","v":0},"","4º ESO",{"$f":"Datos!O19","v":0},{"$f":"Datos!P19","v":0},{"$f":"IF(Datos!P19<>\"S\",Datos!R$1,Datos!Q19)","v":0},{"$f":"Datos!R19","v":0}]
[{"$f":"Datos!A20","v":"Asign 3"},{"$f":"Datos!B20","v":0},"","4º ESO",{"$f":"Datos!O20","v":0},{"$f":"Datos!P20","v":0},{"$f":"IF(Datos!P20<>\"S\",Datos!R$1,Datos!Q20)","v":0},{"$f":"Datos!R20","v":0}]
[{"$f":"Datos!A21","v":"Asign 4"},{"$f":"Datos!B21","v":0},"","4º ESO",{"$f":"Datos!O21","v":0},{"$f":"Datos!P21","v":0},{"$f":"IF(Datos!P21<>\"S\",Datos!R$1,Datos!Q21)","v":0},{"$f":"Datos!R21","v":0}]
[{"$f":"Datos!A22","v":"Asign 5"},{"$f":"Datos!B22","v":0},"","4º ESO",{"$f":"Datos!O22","v":0},{"$f":"Datos!P22","v":0},{"$f":"IF(Datos!P22<>\"S\",Datos!R$1,Datos!Q22)","v":0},{"$f":"Datos!R22","v":0}]
[{"$f":"Datos!A23","v":"Hist Relig"},{"$f":"Datos!B23","v":0},"","4º ESO",{"$f":"Datos!O23","v":0},{"$f":"Datos!P23","v":0},{"$f":"IF(Datos!P23<>\"S\",Datos!R$1,Datos!Q23)","v":0},{"$f":"Datos!R23","v":0}]
[{"$f":"Datos!A24","v":"Ámbito CT"},{"$f":"Datos!B24","v":0},"","4º ESO",{"$f":"Datos!O24","v":0},{"$f":"Datos!P24","v":0},{"$f":"IF(Datos!P24<>\"S\",Datos!R$1,Datos!Q24)","v":0},{"$f":"Datos!R24","v":0}]
[{"$f":"Datos!A25","v":"Ámbito SL"},{"$f":"Datos!B25","v":0},"","4º ESO",{"$f":"Datos!O25","v":0},{"$f":"Datos!P25","v":0},{"$f":"IF(Datos!P25<>\"S\",Datos!R$1,Datos!Q25)","v":0},{"$f":"Datos!R25","v":0}]
[{"$f":"Datos!A26","v":"Economía"},{"$f":"Datos!B26","v":0},"","4º ESO",{"$f":"Datos!O26","v":0},{"$f":"Datos!P26","v":0},{"$f":"IF(Datos!P26<>\"S\",Datos!R$1,Datos!Q26)","v":0},{"$f":"Datos!R26","v":0}]
[{"$f":"Datos!A27","v":"Ed Ciudadanía"},{"$f":"Datos!B27","v":0},"","4º ESO",{"$f":"Datos!O27","v":0},{"$f":"Datos!P27","v":0},{"$f":"IF(Datos!P27<>\"S\",Datos!R$1,Datos!Q27)","v":0},{"$f":"Datos!R27","v":0}]
[{"$f":"Datos!A28","v":"Electrotecnia"},{"$f":"Datos!B28","v":0},"","4º ESO",{"$f":"Datos!O28","v":0},{"$f":"Datos!P28","v":0},{"$f":"IF(Datos!P28<>\"S\",Datos!R$1,Datos!Q28)","v":0},{"$f":"Datos!R28","v":0}]
[{"$f":"Datos!A29","v":"Filosofía"},{"$f":"Datos!B29","v":0},"","4º ESO",{"$f":"Datos!O29","v":0},{"$f":"Datos!P29","v":0},{"$f":"IF(Datos!P29<>\"S\",Datos!R$1,Datos!Q29)","v":0},{"$f":"Datos!R29","v":0}]
[{"$f":"Datos!A30","v":"Física "},{"$f":"Datos!B30","v":0},"","4º ESO",{"$f":"Datos!O30","v":0},{"$f":"Datos!P30","v":0},{"$f":"IF(Datos!P30<>\"S\",Datos!R$1,Datos!Q30)","v":0},{"$f":"Datos!R30","v":0}]
[{"$f":"Datos!A31","v":"FOL"},{"$f":"Datos!B31","v":0},"","4º ESO",{"$f":"Datos!O31","v":0},{"$f":"Datos!P31","v":0},{"$f":"IF(Datos!P31<>\"S\",Datos!R$1,Datos!Q31)","v":0},{"$f":"Datos!R31","v":0}]
[{"$f":"Datos!A32","v":"Fundamentos"},{"$f":"Datos!B32","v":0},"","4º ESO",{"$f":"Datos!O32","v":0},{"$f":"Datos!P32","v":0},{"$f":"IF(Datos!P32<>\"S\",Datos!R$1,Datos!Q32)","v":0},{"$f":"Datos!R32","v":0}]
[{"$f":"Datos!A33","v":"Geología"},{"$f":"Datos!B33","v":0},"","4º ESO",{"$f":"Datos!O33","v":0},{"$f":"Datos!P33","v":0},{"$f":"IF(Datos!P33<>\"S\",Datos!R$1,Datos!Q33)","v":0},{"$f":"Datos!R33","v":0}]
[{"$f":"Datos!A34","v":"Griego"},{"$f":"Datos!B34","v":0},"","4º ESO",{"$f":"Datos!O34","v":0},{"$f":"Datos!P34","v":0},{"$f":"IF(Datos!P34<>\"S\",Datos!R$1,Datos!Q34)","v":0},{"$f":"Datos!R34","v":0}]
[{"$f":"Datos!A35","v":"Historia"},{"$f":"Datos!B35","v":0},"","4º ESO",{"$f":"Datos!O35","v":0},{"$f":"Datos!P35","v":0},{"$f":"IF(Datos!P35<>\"S\",Datos!R$1,Datos!Q35)","v":0},{"$f":"Datos!R35","v":0}]
[{"$f":"Datos!A36","v":"Historia Arte"},{"$f":"Datos!B36","v":0},"","4º ESO",{"$f":"Datos!O36","v":0},{"$f":"Datos!P36","v":0},{"$f":"IF(Datos!P36<>\"S\",Datos!R$1,Datos!Q36)","v":0},{"$f":"Datos!R36","v":0}]
[{"$f":"Datos!A37","v":"Inglés Profes"},{"$f":"Datos!B37","v":0},"","4º ESO",{"$f":"Datos!O37","v":0},{"$f":"Datos!P37","v":0},{"$f":"IF(Datos!P37<>\"S\",Datos!R$1,Datos!Q37)","v":0},{"$f":"Datos!R37","v":0}]
[{"$f":"Datos!A38","v":"Latín"},{"$f":"Datos!B38","v":0},"","4º ESO",{"$f":"Datos!O38","v":0},{"$f":"Datos!P38","v":0},{"$f":"IF(Datos!P38<>\"S\",Datos!R$1,Datos!Q38)","v":0},{"$f":"Datos!R38","v":0}]
[{"$f":"Datos!A39","v":"Literatura"},{"$f":"Datos!B39","v":0},"","4º ESO",{"$f":"Datos!O39","v":0},{"$f":"Datos!P39","v":0},{"$f":"IF(Datos!P39<>\"S\",Datos!R$1,Datos!Q39)","v":0},{"$f":"Datos!R39","v":0}]
[{"$f":"Datos!A40","v":"Mecánica"},{"$f":"Datos!B40","v":0},"","4º ESO",{"$f":"Datos!O40","v":0},{"$f":"Datos!P40","v":0},{"$f":"IF(Datos!P40<>\"S\",Datos!R$1,Datos!Q40)","v":0},{"$f":"Datos!R40","v":0}]
[{"$f":"Datos!A41","v":"Psicología"},{"$f":"Datos!B41","v":0},"","4º ESO",{"$f":"Datos!O41","v":0},{"$f":"Datos!P41","v":0},{"$f":"IF(Datos!P41<>\"S\",Datos!R$1,Datos!Q41)","v":0},{"$f":"Datos!R41","v":0}]
[{"$f":"Datos!A42","v":"Química"},{"$f":"Datos!B42","v":0},"","4º ESO",{"$f":"Datos!O42","v":0},{"$f":"Datos!P42","v":0},{"$f":"IF(Datos!P42<>\"S\",Datos!R$1,Datos!Q42)","v":0},{"$f":"Datos!R42","v":0}]
[{"$f":"Datos!A3","v":"Biología"},{"$f":"Datos!B3","v":0},"","1º BACH",{"$f":"Datos!S3","v":0},{"$f":"Datos!T3","v":0},{"$f":"IF(Datos!T3<>\"S\",Datos!V$1,Datos!U3)","v":0},{"$f":"Datos!V3","v":0}]
[{"$f":"Datos!A4","v":"Dibujo"},{"$f":"Datos!B4","v":0},"","1º BACH",{"$f":"Datos!S4","v":0},{"$f":"Datos!T4","v":0},{"$f":"IF(Datos!T4<>\"S\",Datos!V$1,Datos!U4)","v":0},{"$f":"Datos!V4","v":0}]
[{"$f":"Datos!A5","v":"Ed Fisica"},{"$f":"Datos!B5","v":0},"","1º BACH",{"$f":"Datos!S5","v":0},{"$f":"Datos!T5","v":0},{"$f":"IF(Datos!T5<>\"S\",Datos!V$1,Datos!U5)","v":0},{"$f":"Datos!V5","v":0}]
[{"$f":"Datos!A6","v":"Ética"},{"$f":"Datos!B6","v":0},"","1º BACH",{"$f":"Datos!S6","v":0},{"$f":"Datos!T6","v":0},{"$f":"IF(Datos!T6<>\"S\",Datos!V$1,Datos!U6)","v":0},{"$f":"Datos!V6","v":0}]
[{"$f":"Datos!A7","v":"Física y Quím"},{"$f":"Datos!B7","v":0},"","1º BACH",{"$f":"Datos!S7","v":0},{"$f":"Datos!T7","v":0},{"$f":"IF(Datos!T7<>\"S\",Datos!V$1,Datos!U7)","v":0},{"$f":"Datos!V7","v":0}]
[{"$f":"Datos!A8","v":"Francés"},{"$f":"Datos!B8","v":0},"","1º BACH",{"$f":"Datos!S8","v":0},{"$f":"Datos!T8","v":0},{"$f":"IF(Datos!T8<>\"S\",Datos!V$1,Datos!U8)","v":0},{"$f":"Datos!V8","v":0}]
[{"$f":"Datos!A9","v":"Geografía"},{"$f":"Datos!B9","v":0},"","1º BACH",{"$f":"Datos!S9","v":0},{"$f":"Datos!T9","v":0},{"$f":"IF(Datos!T9<>\"S\",Datos!V$1,Datos!U9)","v":0},{"$f":"Datos!V9","v":0}]
[{"$f":"Datos!A10","v":"Informática"},{"$f":"Datos!B10","v":0},"","1º BACH",{"$f":"Datos!S10","v":0},{"$f":"Datos!T10","v":0},{"$f":"IF(Datos!T10<>\"S\",Datos!V$1,Datos!U10)","v":0},{"$f":"Datos!V10","v":0}]
[{"$f":"Datos!A11","v":"Inglés"},{"$f":"Datos!B11","v":0},"","1º BACH",{"$f":"Datos!S11","v":0},{"$f":"Datos!T11","v":0},{"$f":"IF(Datos!T11<>\"S\",Datos!V$1,Datos!U11)","v":0},{"$f":"Datos!V11","v":0}]
[{"$f":"Datos!A12","v":"Lengua Cast"},{"$f":"Datos!B12","v":0},"","1º BACH",{"$f":"Datos!S12","v":0},{"$f":"Datos!T12","v":0},{"$f":"IF(Datos!T12<>\"S\",Datos!V$1,Datos!U12)","v":0},{"$f":"Datos!V12","v":0}]
[{"$f":"Datos!A13","v":"Matemáticas"},{"$f":"Datos!B13","v":0},"","1º BACH",{"$f":"Datos!S13","v":0},{"$f":"Datos!T13","v":0},{"$f":"IF(Datos!T13<>\"S\",Datos!V$1,Datos!U13)","v":0},{"$f":"Datos!V13","v":0}]
[{"$f":"Datos!A14","v":"Música"},{"$f":"Datos!B14","v":0},"","1º BACH",{"$f":"Datos!S14","v":0},{"$f":"Datos!T14","v":0},{"$f":"IF(Datos!T14<>\"S\",Datos!V$1,Datos!U14)","v":0},{"$f":"Datos!V14","v":0}]
[{"$f":"Datos!A15","v":"Tecnología"},{"$f":"Datos!B15","v":0},"","1º BACH",{"$f":"Datos!S15","v":0},{"$f":"Datos!T15","v":0},{"$f":"IF(Datos!T15<>\"S\",Datos!V$1,Datos!U15)","v":0},{"$f":"Datos!V15","v":0}]
[{"$f":"Datos!A16","v":"Taller Mat"},{"$f":"Datos!B16","v":0},"","1º BACH",{"$f":"Datos!S16","v":0},{"$f":"Datos!T16","v":0},{"$f":"IF(Datos!T16<>\"S\",Datos!V$1,Datos!U16)","v":0},{"$f":"Datos!V16","v":0}]
[{"$f":"Datos!A17","v":"taller Leng"},{"$f":"Datos!B17","v":0},"","1º BACH",{"$f":"Datos!S17","v":0},{"$f":"Datos!T17","v":0},{"$f":"IF(Datos!T17<>\"S\",Datos!V$1,Datos!U17)","v":0},{"$f":"Datos!V17","v":0}]
[{"$f":"Datos!A18","v":"Asign 1"},{"$f":"Datos!B18","v":0},"","1º BACH",{"$f":"Datos!S18","v":0},{"$f":"Datos!T18","v":0},{"$f":"IF(Datos!T18<>\"S\",Datos!V$1,Datos!U18)","v":0},{"$f":"Datos!V18","v":0}]
[{"$f":"Datos!A19","v":"Asign 2"},{"$f":"Datos!B19","v":0},"","1º BACH",{"$f":"Datos!S19","v":0},{"$f":"Datos!T19","v":0},{"$f":"IF(Datos!T19<>\"S\",Datos!V$1,Datos!U19)","v":0},{"$f":"Datos!V19","v":0}]
[{"$f":"Datos!A20","v":"Asign 3"},{"$f":"Datos!B20","v":0},"","1º BACH",{"$f":"Datos!S20","v":0},{"$f":"Datos!T20","v":0},{"$f":"IF(Datos!T20<>\"S\",Datos!V$1,Datos!U20)","v":0},{"$f":"Datos!V20","v":0}]
[{"$f":"Datos!A21","v":"Asign 4"},{"$f":"Datos!B21","v":0},"","1º BACH",{"$f":"Datos!S21","v":0},{"$f":"Datos!T21","v":0},{"$f":"IF(Datos!T21<>\"S\",Datos!V$1,Datos!U21)","v":0},{"$f":"Datos!V21","v":0}]
[{"$f":"Datos!A22","v":"Asign 5"},{"$f":"Datos!B22","v":0},"","1º BACH",{"$f":"Datos!S22","v":0},{"$f":"Datos!T22","v":0},{"$f":"IF(Datos!T22<>\"S\",Datos!V$1,Datos!U22)","v":0},{"$f":"Datos!V22","v":0}]
[{"$f":"Datos!A23","v":"Hist Relig"},{"$f":"Datos!B23","v":0},"","1º BACH",{"$f":"Datos!S23","v":0},{"$f":"Datos!T23","v":0},{"$f":"IF(Datos!T23<>\"S\",Datos!V$1,Datos!U23)","v":0},{"$f":"Datos!V23","v":0}]
[{"$f":"Datos!A24","v":"Ámbito CT"},{"$f":"Datos!B24","v":0},"","1º BACH",{"$f":"Datos!S24","v":0},{"$f":"Datos!T24","v":0},{"$f":"IF(Datos!T24<>\"S\",Datos!V$1,Datos!U24)","v":0},{"$f":"Datos!V24","v":0}]
[{"$f":"Datos!A25","v":"Ámbito SL"},{"$f":"Datos!B25","v":0},"","1º BACH",{"$f":"Datos!S25","v":0},{"$f":"Datos!T25","v":0},{"$f":"IF(Datos!T25<>\"S\",Datos!V$1,Datos!U25)","v":0},{"$f":"Datos!V25","v":0}]
[{"$f":"Datos!A26","v":"Economía"},{"$f":"Datos!B26","v":0},"","1º BACH",{"$f":"Datos!S26","v":0},{"$f":"Datos!T26","v":0},{"$f":"IF(Datos!T26<>\"S\",Datos!V$1,Datos!U26)","v":0},{"$f":"Datos!V26","v":0}]
[{"$f":"Datos!A27","v":"Ed Ciudadanía"},{"$f":"Datos!B27","v":0},"","1º BACH",{"$f":"Datos!S27","v":0},{"$f":"Datos!T27","v":0},{"$f":"IF(Datos!T27<>\"S\",Datos!V$1,Datos!U27)","v":0},{"$f":"Datos!V27","v":0}]
[{"$f":"Datos!A28","v":"Electrotecnia"},{"$f":"Datos!B28","v":0},"","1º BACH",{"$f":"Datos!S28","v":0},{"$f":"Datos!T28","v":0},{"$f":"IF(Datos!T28<>\"S\",Datos!V$1,Datos!U28)","v":0},{"$f":"Datos!V28","v":0}]
[{"$f":"Datos!A29","v":"Filosofía"},{"$f":"Datos!B29","v":0},"","1º BACH",{"$f":"Datos!S29","v":0},{"$f":"Datos!T29","v":0},{"$f":"IF(Datos!T29<>\"S\",Datos!V$1,Datos!U29)","v":0},{"$f":"Datos!V29","v":0}]
[{"$f":"Datos!A30","v":"Física "},{"$f":"Datos!B30","v":0},"","1º BACH",{"$f":"Datos!S30","v":0},{"$f":"Datos!T30","v":0},{"$f":"IF(Datos!T30<>\"S\",Datos!V$1,Datos!U30)","v":0},{"$f":"Datos!V30","v":0}]
[{"$f":"Datos!A31","v":"FOL"},{"$f":"Datos!B31","v":0},"","1º BACH",{"$f":"Datos!S31","v":0},{"$f":"Datos!T31","v":0},{"$f":"IF(Datos!T31<>\"S\",Datos!V$1,Datos!U31)","v":0},{"$f":"Datos!V31","v":0}]
[{"$f":"Datos!A32","v":"Fundamentos"},{"$f":"Datos!B32","v":0},"","1º BACH",{"$f":"Datos!S32","v":0},{"$f":"Datos!T32","v":0},{"$f":"IF(Datos!T32<>\"S\",Datos!V$1,Datos!U32)","v":0},{"$f":"Datos!V32","v":0}]
[{"$f":"Datos!A33","v":"Geología"},{"$f":"Datos!B33","v":0},"","1º BACH",{"$f":"Datos!S33","v":0},{"$f":"Datos!T33","v":0},{"$f":"IF(Datos!T33<>\"S\",Datos!V$1,Datos!U33)","v":0},{"$f":"Datos!V33","v":0}]
[{"$f":"Datos!A34","v":"Griego"},{"$f":"Datos!B34","v":0},"","1º BACH",{"$f":"Datos!S34","v":0},{"$f":"Datos!T34","v":0},{"$f":"IF(Datos!T34<>\"S\",Datos!V$1,Datos!U34)","v":0},{"$f":"Datos!V34","v":0}]
[{"$f":"Datos!A35","v":"Historia"},{"$f":"Datos!B35","v":0},"","1º BACH",{"$f":"Datos!S35","v":0},{"$f":"Datos!T35","v":0},{"$f":"IF(Datos!T35<>\"S\",Datos!V$1,Datos!U35)","v":0},{"$f":"Datos!V35","v":0}]
[{"$f":"Datos!A36","v":"Historia Arte"},{"$f":"Datos!B36","v":0},{"$f":"IF(H196<>0,B196,\"\")","v":""},"1º BACH",{"$f":"Datos!S36","v":0},{"$f":"Datos!T36","v":0},{"$f":"IF(Datos!T36<>\"S\",Datos!V$1,Datos!U36)","v":0},{"$f":"Datos!V36","v":0}]
[{"$f":"Datos!A37","v":"Inglés Profes"},{"$f":"Datos!B37","v":0},"","1º BACH",{"$f":"Datos!S37","v":0},{"$f":"Datos!T37","v":0},{"$f":"IF(Datos!T37<>\"S\",Datos!V$1,Datos!U37)","v":0},{"$f":"Datos!V37","v":0}]
[{"$f":"Datos!A38","v":"Latín"},{"$f":"Datos!B38","v":0},"","1º BACH",{"$f":"Datos!S38","v":0},{"$f":"Datos!T38","v":0},{"$f":"IF(Datos!T38<>\"S\",Datos!V$1,Datos!U38)","v":0},{"$f":"Datos!V38","v":0}]
[{"$f":"Datos!A39","v":"Literatura"},{"$f":"Datos!B39","v":0},"","1º BACH",{"$f":"Datos!S39","v":0},{"$f":"Datos!T39","v":0},{"$f":"IF(Datos!T39<>\"S\",Datos!V$1,Datos!U39)","v":0},{"$f":"Datos!V39","v":0}]
[{"$f":"Datos!A40","v":"Mecánica"},{"$f":"Datos!B40","v":0},"","1º BACH",{"$f":"Datos!S40","v":0},{"$f":"Datos!T40","v":0},{"$f":"IF(Datos!T40<>\"S\",Datos!V$1,Datos!U40)","v":0},{"$f":"Datos!V40","v":0}]
[{"$f":"Datos!A41","v":"Psicología"},{"$f":"Datos!B41","v":0},"","1º BACH",{"$f":"Datos!S41","v":0},{"$f":"Datos!T41","v":0},{"$f":"IF(Datos!T41<>\"S\",Datos!V$1,Datos!U41)","v":0},{"$f":"Datos!V41","v":0}]
[{"$f":"Datos!A42","v":"Química"},{"$f":"Datos!B42","v":0},"","1º BACH",{"$f":"Datos!S42","v":0},{"$f":"Datos!T42","v":0},{"$f":"IF(Datos!T42<>\"S\",Datos!V$1,Datos!U42)","v":0},{"$f":"Datos!V42","v":0}]
[{"$f":"Datos!A3","v":"Biología"},{"$f":"Datos!B3","v":0},"","2º BACH",{"$f":"Datos!W3","v":0},{"$f":"Datos!X3","v":0},{"$f":"IF(Datos!X3<>\"S\",Datos!Z$1,Datos!Y3)","v":0},{"$f":"Datos!Z3","v":0}]
[{"$f":"Datos!A4","v":"Dibujo"},{"$f":"Datos!B4","v":0},"","2º BACH",{"$f":"Datos!W4","v":0},{"$f":"Datos!X4","v":0},{"$f":"IF(Datos!X4<>\"S\",Datos!Z$1,Datos!Y4)","v":0},{"$f":"Datos!Z4","v":0}]
[{"$f":"Datos!A5","v":"Ed Fisica"},{"$f":"Datos!B5","v":0},"","2º BACH",{"$f":"Datos!W5","v":0},{"$f":"Datos!X5","v":0},{"$f":"IF(Datos!X5<>\"S\",Datos!Z$1,Datos!Y5)","v":0},{"$f":"Datos!Z5","v":0}]
[{"$f":"Datos!A6","v":"Ética"},{"$f":"Datos!B6","v":0},"","2º BACH",{"$f":"Datos!W6","v":0},{"$f":"Datos!X6","v":0},{"$f":"IF(Datos!X6<>\"S\",Datos!Z$1,Datos!Y6)","v":0},{"$f":"Datos!Z6","v":0}]
[{"$f":"Datos!A7","v":"Física y Quím"},{"$f":"Datos!B7","v":0},"","2º BACH",{"$f":"Datos!W7","v":0},{"$f":"Datos!X7","v":0},{"$f":"IF(Datos!X7<>\"S\",Datos!Z$1,Datos!Y7)","v":0},{"$f":"Datos!Z7","v":0}]
[{"$f":"Datos!A8","v":"Francés"},{"$f":"Datos!B8","v":0},"","2º BACH",{"$f":"Datos!W8","v":0},{"$f":"Datos!X8","v":0},{"$f":"IF(Datos!X8<>\"S\",Datos!Z$1,Datos!Y8)","v":0},{"$f":"Datos!Z8","v":0}]
[{"$f":"Datos!A9","v":"Geografía"},{"$f":"Datos!B9","v":0},"","2º BACH",{"$f":"Datos!W9","v":0},{"$f":"Datos!X9","v":0},{"$f":"IF(Datos!X9<>\"S\",Datos!Z$1,Datos!Y9)","v":0},{"$f":"Datos!Z9","v":0}]
[{"$f":"Datos!A10","v":"Informática"},{"$f":"Datos!B10","v":0},"","2º BACH",{"$f":"Datos!W10","v":0},{"$f":"Datos!X10","v":0},{"$f":"IF(Datos!X10<>\"S\",Datos!Z$1,Datos!Y10)","v":0},{"$f":"Datos!Z10","v":0}]
[{"$f":"Datos!A11","v":"Inglés"},{"$f":"Datos!B11","v":0},"","2º BACH",{"$f":"Datos!W11","v":0},{"$f":"Datos!X11","v":0},{"$f":"IF(Datos!X11<>\"S\",Datos!Z$1,Datos!Y11)","v":0},{"$f":"Datos!Z11","v":0}]
[{"$f":"Datos!A12","v":"Lengua Cast"},{"$f":"Datos!B12","v":0},"","2º BACH",{"$f":"Datos!W12","v":0},{"$f":"Datos!X12","v":0},{"$f":"IF(Datos!X12<>\"S\",Datos!Z$1,Datos!Y12)","v":0},{"$f":"Datos!Z12","v":0}]
[{"$f":"Datos!A13","v":"Matemáticas"},{"$f":"Datos!B13","v":0},"","2º BACH",{"$f":"Datos!W13","v":0},{"$f":"Datos!X13","v":0},{"$f":"IF(Datos!X13<>\"S\",Datos!Z$1,Datos!Y13)","v":0},{"$f":"Datos!Z13","v":0}]
[{"$f":"Datos!A14","v":"Música"},{"$f":"Datos!B14","v":0},"","2º BACH",{"$f":"Datos!W14","v":0},{"$f":"Datos!X14","v":0},{"$f":"IF(Datos!X14<>\"S\",Datos!Z$1,Datos!Y14)","v":0},{"$f":"Datos!Z14","v":0}]
[{"$f":"Datos!A15","v":"Tecnología"},{"$f":"Datos!B15","v":0},"","2º BACH",{"$f":"Datos!W15","v":0},{"$f":"Datos!X15","v":0},{"$f":"IF(Datos!X15<>\"S\",Datos!Z$1,Datos!Y15)","v":0},{"$f":"Datos!Z15","v":0}]
[{"$f":"Datos!A16","v":"Taller Mat"},{"$f":"Datos!B16","v":0},"","2º BACH",{"$f":"Datos!W16","v":0},{"$f":"Datos!X16","v":0},{"$f":"IF(Datos!X16<>\"S\",Datos!Z$1,Datos!Y16)","v":0},{"$f":"Datos!Z16","v":0}]
[{"$f":"Datos!A17","v":"taller Leng"},{"$f":"Datos!B17","v":0},"","2º BACH",{"$f":"Datos!W17","v":0},{"$f":"Datos!X17","v":0},{"$f":"IF(Datos!X17<>\"S\",Datos!Z$1,Datos!Y17)","v":0},{"$f":"Datos!Z17","v":0}]
[{"$f":"Datos!A18","v":"Asign 1"},{"$f":"Datos!B18","v":0},"","2º BACH",{"$f":"Datos!W18","v":0},{"$f":"Datos!X18","v":0},{"$f":"IF(Datos!X18<>\"S\",Datos!Z$1,Datos!Y18)","v":0},{"$f":"Datos!Z18","v":0}]
[{"$f":"Datos!A19","v":"Asign 2"},{"$f":"Datos!B19","v":0},"","2º BACH",{"$f":"Datos!W19","v":0},{"$f":"Datos!X19","v":0},{"$f":"IF(Datos!X19<>\"S\",Datos!Z$1,Datos!Y19)","v":0},{"$f":"Datos!Z19","v":0}]
[{"$f":"Datos!A20","v":"Asign 3"},{"$f":"Datos!B20","v":0},"","2º BACH",{"$f":"Datos!W20","v":0},{"$f":"Datos!X20","v":0},{"$f":"IF(Datos!X20<>\"S\",Datos!Z$1,Datos!Y20)","v":0},{"$f":"Datos!Z20","v":0}]
[{"$f":"Datos!A21","v":"Asign 4"},{"$f":"Datos!B21","v":0},"","2º BACH",{"$f":"Datos!W21","v":0},{"$f":"Datos!X21","v":0},{"$f":"IF(Datos!X21<>\"S\",Datos!Z$1,Datos!Y21)","v":0},{"$f":"Datos!Z21","v":0}]
[{"$f":"Datos!A22","v":"Asign 5"},{"$f":"Datos!B22","v":0},"","2º BACH",{"$f":"Datos!W22","v":0},{"$f":"Datos!X22","v":0},{"$f":"IF(Datos!X22<>\"S\",Datos!Z$1,Datos!Y22)","v":0},{"$f":"Datos!Z22","v":0}]
[{"$f":"Datos!A23","v":"Hist Relig"},{"$f":"Datos!B23","v":0},"","2º BACH",{"$f":"Datos!W23","v":0},{"$f":"Datos!X23","v":0},{"$f":"IF(Datos!X23<>\"S\",Datos!Z$1,Datos!Y23)","v":0},{"$f":"Datos!Z23","v":0}]
[{"$f":"Datos!A24","v":"Ámbito CT"},{"$f":"Datos!B24","v":0},"","2º BACH",{"$f":"Datos!W24","v":0},{"$f":"Datos!X24","v":0},{"$f":"IF(Datos!X24<>\"S\",Datos!Z$1,Datos!Y24)","v":0},{"$f":"Datos!Z24","v":0}]
[{"$f":"Datos!A25","v":"Ámbito SL"},{"$f":"Datos!B25","v":0},"","2º BACH",{"$f":"Datos!W25","v":0},{"$f":"Datos!X25","v":0},{"$f":"IF(Datos!X25<>\"S\",Datos!Z$1,Datos!Y25)","v":0},{"$f":"Datos!Z25","v":0}]
[{"$f":"Datos!A26","v":"Economía"},{"$f":"Datos!B26","v":0},"","2º BACH",{"$f":"Datos!W26","v":0},{"$f":"Datos!X26","v":0},{"$f":"IF(Datos!X26<>\"S\",Datos!Z$1,Datos!Y26)","v":0},{"$f":"Datos!Z26","v":0}]
[{"$f":"Datos!A27","v":"Ed Ciudadanía"},{"$f":"Datos!B27","v":0},"","2º BACH",{"$f":"Datos!W27","v":0},{"$f":"Datos!X27","v":0},{"$f":"IF(Datos!X27<>\"S\",Datos!Z$1,Datos!Y27)","v":0},{"$f":"Datos!Z27","v":0}]
[{"$f":"Datos!A28","v":"Electrotecnia"},{"$f":"Datos!B28","v":0},"","2º BACH",{"$f":"Datos!W28","v":0},{"$f":"Datos!X28","v":0},{"$f":"IF(Datos!X28<>\"S\",Datos!Z$1,Datos!Y28)","v":0},{"$f":"Datos!Z28","v":0}]
[{"$f":"Datos!A29","v":"Filosofía"},{"$f":"Datos!B29","v":0},"","2º BACH",{"$f":"Datos!W29","v":0},{"$f":"Datos!X29","v":0},{"$f":"IF(Datos!X29<>\"S\",Datos!Z$1,Datos!Y29)","v":0},{"$f":"Datos!Z29","v":0}]
[{"$f":"Datos!A30","v":"Física "},{"$f":"Datos!B30","v":0},"","2º BACH",{"$f":"Datos!W30","v":0},{"$f":"Datos!X30","v":0},{"$f":"IF(Datos!X30<>\"S\",Datos!Z$1,Datos!Y30)","v":0},{"$f":"Datos!Z30","v":0}]
[{"$f":"Datos!A31","v":"FOL"},{"$f":"Datos!B31","v":0},"","2º BACH",{"$f":"Datos!W31","v":0},{"$f":"Datos!X31","v":0},{"$f":"IF(Datos!X31<>\"S\",Datos!Z$1,Datos!Y31)","v":0},{"$f":"Datos!Z31","v":0}]
[{"$f":"Datos!A32","v":"Fundamentos"},{"$f":"Datos!B32","v":0},"","2º BACH",{"$f":"Datos!W32","v":0},{"$f":"Datos!X32","v":0},{"$f":"IF(Datos!X32<>\"S\",Datos!Z$1,Datos!Y32)","v":0},{"$f":"Datos!Z32","v":0}]
[{"$f":"Datos!A33","v":"Geología"},{"$f":"Datos!B33","v":0},"","2º BACH",{"$f":"Datos!W33","v":0},{"$f":"Datos!X33","v":0},{"$f":"IF(Datos!X33<>\"S\",Datos!Z$1,Datos!Y33)","v":0},{"$f":"Datos!Z33","v":0}]
[{"$f":"Datos!A34","v":"Griego"},{"$f":"Datos!B34","v":0},"","2º BACH",{"$f":"Datos!W34","v":0},{"$f":"Datos!X34","v":0},{"$f":"IF(Datos!X34<>\"S\",Datos!Z$1,Datos!Y34)","v":0},{"$f":"Datos!Z34","v":0}]
[{"$f":"Datos!A35","v":"Historia"},{"$f":"Datos!B35","v":0},"","2º BACH",{"$f":"Datos!W35","v":0},{"$f":"Datos!X35","v":0},{"$f":"IF(Datos!X35<>\"S\",Datos!Z$1,Datos!Y35)","v":0},{"$f":"Datos!Z35","v":0}]
[{"$f":"Datos!A36","v":"Historia Arte"},{"$f":"Datos!B36","v":0},"","2º BACH",{"$f":"Datos!W36","v":0},{"$f":"Datos!X36","v":0},{"$f":"IF(Datos!X36<>\"S\",Datos!Z$1,Datos!Y36)","v":0},{"$f":"Datos!Z36","v":0}]
[{"$f":"Datos!A37","v":"Inglés Profes"},{"$f":"Datos!B37","v":0},"","2º BACH",{"$f":"Datos!W37","v":0},{"$f":"Datos!X37","v":0},{"$f":"IF(Datos!X37<>\"S\",Datos!Z$1,Datos!Y37)","v":0},{"$f":"Datos!Z37","v":0}]
[{"$f":"Datos!A38","v":"Latín"},{"$f":"Datos!B38","v":0},"","2º BACH",{"$f":"Datos!W38","v":0},{"$f":"Datos!X38","v":0},{"$f":"IF(Datos!X38<>\"S\",Datos!Z$1,Datos!Y38)","v":0},{"$f":"Datos!Z38","v":0}]
[{"$f":"Datos!A39","v":"Literatura"},{"$f":"Datos!B39","v":0},"","2º BACH",{"$f":"Datos!W39","v":0},{"$f":"Datos!X39","v":0},{"$f":"IF(Datos!X39<>\"S\",Datos!Z$1,Datos!Y39)","v":0},{"$f":"Datos!Z39","v":0}]
[{"$f":"Datos!A40","v":"Mecánica"},{"$f":"Datos!B40","v":0},"","2º BACH",{"$f":"Datos!W40","v":0},{"$f":"Datos!X40","v":0},{"$f":"IF(Datos!X40<>\"S\",Datos!Z$1,Datos!Y40)","v":0},{"$f":"Datos!Z40","v":0}]
[{"$f":"Datos!A41","v":"Psicología"},{"$f":"Datos!B41","v":0},"","2º BACH",{"$f":"Datos!W41","v":0},{"$f":"Datos!X41","v":0},{"$f":"IF(Datos!X41<>\"S\",Datos!Z$1,Datos!Y41)","v":0},{"$f":"Datos!Z41","v":0}]
[{"$f":"Datos!A42","v":"Química"},{"$f":"Datos!B42","v":0},"","2º BACH",{"$f":"Datos!W42","v":0},{"$f":"Datos!X42","v":0},{"$f":"IF(Datos!X42<>\"S\",Datos!Z$1,Datos!Y42)","v":0},{"$f":"Datos!Z42","v":0}]
["Tutoría",{"$f":"'Otros Datos'!I2","v":"Biología"},"","1º ESO",{"$f":"CUPO!O$3","v":0},null,{"$f":"COUNTIF(CUPO!$M$3:$AA$3,B243)","v":0},{"$f":"E243*G243","v":0}]
["Tutoría",{"$f":"'Otros Datos'!I3","v":"Economía"},"","1º ESO",{"$f":"CUPO!O$3","v":0},null,{"$f":"COUNTIF(CUPO!$M$3:$AA$3,B244)","v":0},{"$f":"E244*G244","v":0}]
["Tutoría",{"$f":"'Otros Datos'!I4","v":"Ed Física"},"","1º ESO",{"$f":"CUPO!O$3","v":0},null,{"$f":"COUNTIF(CUPO!$M$3:$AA$3,B245)","v":0},{"$f":"E245*G245","v":0}]
["Tutoría",{"$f":"'Otros Datos'!I5","v":"EPV"},"","1º ESO",{"$f":"CUPO!O$3","v":0},null,{"$f":"COUNTIF(CUPO!$M$3:$AA$3,B246)","v":0},0]
["Tutoría",{"$f":"'Otros Datos'!I6","v":"Filosofía"},"","1º ESO",{"$f":"CUPO!O$3","v":0},null,{"$f":"COUNTIF(CUPO!$M$3:$AA$3,B247)","v":0},0]
["Tutoría",{"$f":"'Otros Datos'!I7","v":"Física y Quim"},"","1º ESO",{"$f":"CUPO!O$3","v":0},null,{"$f":"COUNTIF(CUPO!$M$3:$AA$3,B248)","v":0},0]
["Tutoría",{"$f":"'Otros Datos'!I8","v":"FOL"},"","1º ESO",{"$f":"CUPO!O$3","v":0},null,{"$f":"COUNTIF(CUPO!$M$3:$AA$3,B249)","v":0},0]
["Tutoría",{"$f":"'Otros Datos'!I9","v":"Francés"},"","1º ESO",{"$f":"CUPO!O$3","v":0},null,{"$f":"COUNTIF(CUPO!$M$3:$AA$3,B250)","v":0},0]
["Tutoría",{"$f":"'Otros Datos'!I10","v":"Geografía"},"","1º ESO",{"$f":"CUPO!O$3","v":0},null,{"$f":"COUNTIF(CUPO!$M$3:$AA$3,B251)","v":0},0]
["Tutoría",{"$f":"'Otros Datos'!I11","v":"Griego"},"","1º ESO",{"$f":"CUPO!O$3","v":0},null,{"$f":"COUNTIF(CUPO!$M$3:$AA$3,B252)","v":0},0]
["Tutoría",{"$f":"'Otros Datos'!I12","v":"Inglés"},"","1º ESO",{"$f":"CUPO!O$3","v":0},null,{"$f":"COUNTIF(CUPO!$M$3:$AA$3,B253)","v":0},0]
["Tutoría",{"$f":"'Otros Datos'!I13","v":"Latín"},"","1º ESO",{"$f":"CUPO!O$3","v":0},null,{"$f":"COUNTIF(CUPO!$M$3:$AA$3,B254)","v":0},0]
["Tutoría",{"$f":"'Otros Datos'!I14","v":"Lengua"},"","1º ESO",{"$f":"CUPO!O$3","v":0},null,{"$f":"COUNTIF(CUPO!$M$3:$AA$3,B255)","v":0},0]
["Tutoría",{"$f":"'Otros Datos'!I15","v":"Matemáticas"},"","1º ESO",{"$f":"CUPO!O$3","v":0},null,{"$f":"COUNTIF(CUPO!$M$3:$AA$3,B256)","v":0},0]
["Tutoría",{"$f":"'Otros Datos'!I16","v":"Música"},"","1º ESO",{"$f":"CUPO!O$3","v":0},null,{"$f":"COUNTIF(CUPO!$M$3:$AA$3,B257)","v":0},0]
["Tutoría",{"$f":"'Otros Datos'!I17","v":"Orientación"},"","1º ESO",{"$f":"CUPO!O$3","v":0},null,{"$f":"COUNTIF(CUPO!$M$3:$AA$3,B258)","v":0},0]
["Tutoría",{"$f":"'Otros Datos'!I18","v":"Tecnología"},"","1º ESO",{"$f":"CUPO!O$3","v":0},null,{"$f":"COUNTIF(CUPO!$M$3:$AA$3,B259)","v":0},0]
["Tutoría",{"$f":"'Otros Datos'!I19","v":"Depart 1"},{"$f":"IF(H260<>0,B260,\"\")","v":""},"1º ESO",{"$f":"CUPO!O$3","v":0},null,{"$f":"COUNTIF(CUPO!$M$3:$AA$3,B260)","v":0},0]
["Tutoría",{"$f":"'Otros Datos'!I20","v":"Depart 2"},"","1º ESO",{"$f":"CUPO!O$3","v":0},null,{"$f":"COUNTIF(CUPO!$M$3:$AA$3,B261)","v":0},0]
["Tutoría",{"$f":"'Otros Datos'!I21","v":"Depart 3"},"","1º ESO",{"$f":"CUPO!O$3","v":0},null,{"$f":"COUNTIF(CUPO!$M$3:$AA$3,B262)","v":0},0]
["Sin Religión",{"$f":"'Otros Datos'!I2","v":"Biología"},"","1º ESO",{"$f":"CUPO!$O$14","v":0},null,{"$f":"COUNTIF(CUPO!$R$14:$AA$14,B263)","v":0},0]
["Sin Religión",{"$f":"'Otros Datos'!I3","v":"Economía"},"","1º ESO",{"$f":"CUPO!$O$14","v":0},null,{"$f":"COUNTIF(CUPO!$R$14:$AA$14,B264)","v":0},0]
["Sin Religión",{"$f":"'Otros Datos'!I4","v":"Ed Física"},"","1º ESO",{"$f":"CUPO!$O$14","v":0},null,{"$f":"COUNTIF(CUPO!$R$14:$AA$14,B265)","v":0},0]
["Sin Religión",{"$f":"'Otros Datos'!I5","v":"EPV"},"","1º ESO",{"$f":"CUPO!$O$14","v":0},null,{"$f":"COUNTIF(CUPO!$R$14:$AA$14,B266)","v":0},0]
["Sin Religión",{"$f":"'Otros Datos'!I6","v":"Filosofía"},"","1º ESO",{"$f":"CUPO!$O$14","v":0},null,{"$f":"COUNTIF(CUPO!$R$14:$AA$14,B267)","v":0},0]
["Sin Religión",{"$f":"'Otros Datos'!I7","v":"Física y Quim"},"","1º ESO",{"$f":"CUPO!$O$14","v":0},null,{"$f":"COUNTIF(CUPO!$R$14:$AA$14,B268)","v":0},0]
["Sin Religión",{"$f":"'Otros Datos'!I8","v":"FOL"},"","1º ESO",{"$f":"CUPO!$O$14","v":0},null,{"$f":"COUNTIF(CUPO!$R$14:$AA$14,B269)","v":0},0]
["Sin Religión",{"$f":"'Otros Datos'!I9","v":"Francés"},"","1º ESO",{"$f":"CUPO!$O$14","v":0},null,{"$f":"COUNTIF(CUPO!$R$14:$AA$14,B270)","v":0},0]
["Sin Religión",{"$f":"'Otros Datos'!I10","v":"Geografía"},"","1º ESO",{"$f":"CUPO!$O$14","v":0},null,{"$f":"COUNTIF(CUPO!$R$14:$AA$14,B271)","v":0},0]
["Sin Religión",{"$f":"'Otros Datos'!I11","v":"Griego"},"","1º ESO",{"$f":"CUPO!$O$14","v":0},null,{"$f":"COUNTIF(CUPO!$R$14:$AA$14,B272)","v":0},0]
["Sin Religión",{"$f":"'Otros Datos'!I12","v":"Inglés"},"","1º ESO",{"$f":"CUPO!$O$14","v":0},null,{"$f":"COUNTIF(CUPO!$R$14:$AA$14,B273)","v":0},0]
["Sin Religión",{"$f":"'Otros Datos'!I13","v":"Latín"},"","1º ESO",{"$f":"CUPO!$O$14","v":0},null,{"$f":"COUNTIF(CUPO!$R$14:$AA$14,B274)","v":0},0]
["Sin Religión",{"$f":"'Otros Datos'!I14","v":"Lengua"},"","1º ESO",{"$f":"CUPO!$O$14","v":0},null,{"$f":"COUNTIF(CUPO!$R$14:$AA$14,B275)","v":0},0]
["Sin Religión",{"$f":"'Otros Datos'!I15","v":"Matemáticas"},"","1º ESO",{"$f":"CUPO!$O$14","v":0},null,{"$f":"COUNTIF(CUPO!$R$14:$AA$14,B276)","v":0},0]
["Sin Religión",{"$f":"'Otros Datos'!I16","v":"Música"},"","1º ESO",{"$f":"CUPO!$O$14","v":0},null,{"$f":"COUNTIF(CUPO!$R$14:$AA$14,B277)","v":0},0]
["Sin Religión",{"$f":"'Otros Datos'!I17","v":"Orientación"},"","1º ESO",{"$f":"CUPO!$O$14","v":0},null,{"$f":"COUNTIF(CUPO!$R$14:$AA$14,B278)","v":0},0]
["Sin Religión",{"$f":"'Otros Datos'!I18","v":"Tecnología"},"","1º ESO",{"$f":"CUPO!$O$14","v":0},null,{"$f":"COUNTIF(CUPO!$R$14:$AA$14,B279)","v":0},0]
["Sin Religión",{"$f":"'Otros Datos'!I19","v":"Depart 1"},"","1º ESO",{"$f":"CUPO!$O$14","v":0},null,{"$f":"COUNTIF(CUPO!$R$14:$AA$14,B280)","v":0},0]
["Sin Religión",{"$f":"'Otros Datos'!I20","v":"Depart 2"},"","1º ESO",{"$f":"CUPO!$O$14","v":0},null,{"$f":"COUNTIF(CUPO!$R$14:$AA$14,B281)","v":0},0]
["Sin Religión",{"$f":"'Otros Datos'!I21","v":"Depart 3"},"","1º ESO",{"$f":"CUPO!$O$14","v":0},null,{"$f":"COUNTIF(CUPO!$R$14:$AA$14,B282)","v":0},0]
["Tutoría",{"$f":"'Otros Datos'!I2","v":"Biología"},"","2º ESO",{"$f":"CUPO!O$4","v":0},null,{"$f":"COUNTIF(CUPO!$R$4:$AA$4,B283)","v":0},0]
["Tutoría",{"$f":"'Otros Datos'!I3","v":"Economía"},"","2º ESO",{"$f":"CUPO!O$4","v":0},null,{"$f":"COUNTIF(CUPO!$R$4:$AA$4,B284)","v":0},0]
["Tutoría",{"$f":"'Otros Datos'!I4","v":"Ed Física"},"","2º ESO",{"$f":"CUPO!O$4","v":0},null,{"$f":"COUNTIF(CUPO!$R$4:$AA$4,B285)","v":0},0]
["Tutoría",{"$f":"'Otros Datos'!I5","v":"EPV"},"","2º ESO",{"$f":"CUPO!O$4","v":0},null,{"$f":"COUNTIF(CUPO!$R$4:$AA$4,B286)","v":0},0]
["Tutoría",{"$f":"'Otros Datos'!I6","v":"Filosofía"},"","2º ESO",{"$f":"CUPO!O$4","v":0},null,{"$f":"COUNTIF(CUPO!$R$4:$AA$4,B287)","v":0},0]
["Tutoría",{"$f":"'Otros Datos'!I7","v":"Física y Quim"},"","2º ESO",{"$f":"CUPO!O$4","v":0},null,{"$f":"COUNTIF(CUPO!$R$4:$AA$4,B288)","v":0},0]
["Tutoría",{"$f":"'Otros Datos'!I8","v":"FOL"},"","2º ESO",{"$f":"CUPO!O$4","v":0},null,{"$f":"COUNTIF(CUPO!$R$4:$AA$4,B289)","v":0},0]
["Tutoría",{"$f":"'Otros Datos'!I9","v":"Francés"},"","2º ESO",{"$f":"CUPO!O$4","v":0},null,{"$f":"COUNTIF(CUPO!$R$4:$AA$4,B290)","v":0},0]
["Tutoría",{"$f":"'Otros Datos'!I10","v":"Geografía"},"","2º ESO",{"$f":"CUPO!O$4","v":0},null,{"$f":"COUNTIF(CUPO!$R$4:$AA$4,B291)","v":0},0]
["Tutoría",{"$f":"'Otros Datos'!I11","v":"Griego"},"","2º ESO",{"$f":"CUPO!O$4","v":0},null,{"$f":"COUNTIF(CUPO!$R$4:$AA$4,B292)","v":0},0]
["Tutoría",{"$f":"'Otros Datos'!I12","v":"Inglés"},"","2º ESO",{"$f":"CUPO!O$4","v":0},null,{"$f":"COUNTIF(CUPO!$R$4:$AA$4,B293)","v":0},0]
["Tutoría",{"$f":"'Otros Datos'!I13","v":"Latín"},"","2º ESO",{"$f":"CUPO!O$4","v":0},null,{"$f":"COUNTIF(CUPO!$R$4:$AA$4,B294)","v":0},0]
["Tutoría",{"$f":"'Otros Datos'!I14","v":"Lengua"},"","2º ESO",{"$f":"CUPO!O$4","v":0},null,{"$f":"COUNTIF(CUPO!$R$4:$AA$4,B295)","v":0},0]
["Tutoría",{"$f":"'Otros Datos'!I15","v":"Matemáticas"},"","2º ESO",{"$f":"CUPO!O$4","v":0},null,{"$f":"COUNTIF(CUPO!$R$4:$AA$4,B296)","v":0},0]
["Tutoría",{"$f":"'Otros Datos'!I16","v":"Música"},"","2º ESO",{"$f":"CUPO!O$4","v":0},null,{"$f":"COUNTIF(CUPO!$R$4:$AA$4,B297)","v":0},0]
["Tutoría",{"$f":"'Otros Datos'!I17","v":"Orientación"},"","2º ESO",{"$f":"CUPO!O$4","v":0},null,{"$f":"COUNTIF(CUPO!$R$4:$AA$4,B298)","v":0},0]
["Tutoría",{"$f":"'Otros Datos'!I18","v":"Tecnología"},"","2º ESO",{"$f":"CUPO!O$4","v":0},null,{"$f":"COUNTIF(CUPO!$R$4:$AA$4,B299)","v":0},0]
["Tutoría",{"$f":"'Otros Datos'!I19","v":"Depart 1"},"","2º ESO",{"$f":"CUPO!O$4","v":0},null,{"$f":"COUNTIF(CUPO!$R$4:$AA$4,B300)","v":0},0]
["Tutoría",{"$f":"'Otros Datos'!I20","v":"Depart 2"},"","2º ESO",{"$f":"CUPO!O$4","v":0},null,{"$f":"COUNTIF(CUPO!$R$4:$AA$4,B301)","v":0},0]
["Tutoría",{"$f":"'Otros Datos'!I21","v":"Depart 3"},"","2º ESO",{"$f":"CUPO!O$4","v":0},null,{"$f":"COUNTIF(CUPO!$R$4:$AA$4,B302)","v":0},0]
["Sin Religión",{"$f":"'Otros Datos'!I2","v":"Biología"},"","2º ESO",{"$f":"CUPO!O$15","v":0},null,{"$f":"COUNTIF(CUPO!$R$15:$AA$15,B303)","v":0},0]
["Sin Religión",{"$f":"'Otros Datos'!I3","v":"Economía"},"","2º ESO",{"$f":"CUPO!O$15","v":0},null,{"$f":"COUNTIF(CUPO!$R$15:$AA$15,B304)","v":0},0]
["Sin Religión",{"$f":"'Otros Datos'!I4","v":"Ed Física"},"","2º ESO",{"$f":"CUPO!O$15","v":0},null,{"$f":"COUNTIF(CUPO!$R$15:$AA$15,B305)","v":0},0]
["Sin Religión",{"$f":"'Otros Datos'!I5","v":"EPV"},"","2º ESO",{"$f":"CUPO!O$15","v":0},null,{"$f":"COUNTIF(CUPO!$R$15:$AA$15,B306)","v":0},0]
["Sin Religión",{"$f":"'Otros Datos'!I6","v":"Filosofía"},"","2º ESO",{"$f":"CUPO!O$15","v":0},null,{"$f":"COUNTIF(CUPO!$R$15:$AA$15,B307)","v":0},0]
["Sin Religión",{"$f":"'Otros Datos'!I7","v":"Física y Quim"},"","2º ESO",{"$f":"CUPO!O$15","v":0},null,{"$f":"COUNTIF(CUPO!$R$15:$AA$15,B308)","v":0},0]
["Sin Religión",{"$f":"'Otros Datos'!I8","v":"FOL"},"","2º ESO",{"$f":"CUPO!O$15","v":0},null,{"$f":"COUNTIF(CUPO!$R$15:$AA$15,B309)","v":0},{"$f":"E309*G309","v":0}]
["Sin Religión",{"$f":"'Otros Datos'!I9","v":"Francés"},"","2º ESO",{"$f":"CUPO!O$15","v":0},null,{"$f":"COUNTIF(CUPO!$R$15:$AA$15,B310)","v":0},0]
["Sin Religión",{"$f":"'Otros Datos'!I10","v":"Geografía"},"","2º ESO",{"$f":"CUPO!O$15","v":0},null,{"$f":"COUNTIF(CUPO!$R$15:$AA$15,B311)","v":0},0]
["Sin Religión",{"$f":"'Otros Datos'!I11","v":"Griego"},"","2º ESO",{"$f":"CUPO!O$15","v":0},null,{"$f":"COUNTIF(CUPO!$R$15:$AA$15,B312)","v":0},0]
["Sin Religión",{"$f":"'Otros Datos'!I12","v":"Inglés"},"","2º ESO",{"$f":"CUPO!O$15","v":0},null,{"$f":"COUNTIF(CUPO!$R$15:$AA$15,B313)","v":0},0]
["Sin Religión",{"$f":"'Otros Datos'!I13","v":"Latín"},"","2º ESO",{"$f":"CUPO!O$15","v":0},null,{"$f":"COUNTIF(CUPO!$R$15:$AA$15,B314)","v":0},0]
["Sin Religión",{"$f":"'Otros Datos'!I14","v":"Lengua"},"","2º ESO",{"$f":"CUPO!O$15","v":0},null,{"$f":"COUNTIF(CUPO!$R$15:$AA$15,B315)","v":0},0]
["Sin Religión",{"$f":"'Otros Datos'!I15","v":"Matemáticas"},"","2º ESO",{"$f":"CUPO!O$15","v":0},null,{"$f":"COUNTIF(CUPO!$R$15:$AA$15,B316)","v":0},0]
["Sin Religión",{"$f":"'Otros Datos'!I16","v":"Música"},"","2º ESO",{"$f":"CUPO!O$15","v":0},null,{"$f":"COUNTIF(CUPO!$R$15:$AA$15,B317)","v":0},0]
["Sin Religión",{"$f":"'Otros Datos'!I17","v":"Orientación"},"","2º ESO",{"$f":"CUPO!O$15","v":0},null,{"$f":"COUNTIF(CUPO!$R$15:$AA$15,B318)","v":0},0]
["Sin Religión",{"$f":"'Otros Datos'!I18","v":"Tecnología"},"","2º ESO",{"$f":"CUPO!O$15","v":0},null,{"$f":"COUNTIF(CUPO!$R$15:$AA$15,B319)","v":0},0]
["Sin Religión",{"$f":"'Otros Datos'!I19","v":"Depart 1"},"","2º ESO",{"$f":"CUPO!O$15","v":0},null,{"$f":"COUNTIF(CUPO!$R$15:$AA$15,B320)","v":0},0]
["Sin Religión",{"$f":"'Otros Datos'!I20","v":"Depart 2"},"","2º ESO",{"$f":"CUPO!O$15","v":0},null,{"$f":"COUNTIF(CUPO!$R$15:$AA$15,B321)","v":0},0]
["Sin Religión",{"$f":"'Otros Datos'!I21","v":"Depart 3"},"","2º ESO",{"$f":"CUPO!O$15","v":0},null,{"$f":"COUNTIF(CUPO!$R$15:$AA$15,B322)","v":0},0]
["Tutoría",{"$f":"'Otros Datos'!I2","v":"Biología"},"","3º ESO",{"$f":"CUPO!O$5","v":0},null,{"$f":"COUNTIF(CUPO!$R$5:$AA$5,B323)","v":0},0]
["Tutoría",{"$f":"'Otros Datos'!I3","v":"Economía"},{"$f":"IF(H324<>0,B324,\"\")","v":""},"3º ESO",{"$f":"CUPO!O$5","v":0},null,{"$f":"COUNTIF(CUPO!$R$5:$AA$5,B324)","v":0},0]
["Tutoría",{"$f":"'Otros Datos'!I4","v":"Ed Física"},"","3º ESO",{"$f":"CUPO!O$5","v":0},null,{"$f":"COUNTIF(CUPO!$R$5:$AA$5,B325)","v":0},0]
["Tutoría",{"$f":"'Otros Datos'!I5","v":"EPV"},"","3º ESO",{"$f":"CUPO!O$5","v":0},null,{"$f":"COUNTIF(CUPO!$R$5:$AA$5,B326)","v":0},0]
["Tutoría",{"$f":"'Otros Datos'!I6","v":"Filosofía"},"","3º ESO",{"$f":"CUPO!O$5","v":0},null,{"$f":"COUNTIF(CUPO!$R$5:$AA$5,B327)","v":0},0]
["Tutoría",{"$f":"'Otros Datos'!I7","v":"Física y Quim"},"","3º ESO",{"$f":"CUPO!O$5","v":0},null,{"$f":"COUNTIF(CUPO!$R$5:$AA$5,B328)","v":0},0]
["Tutoría",{"$f":"'Otros Datos'!I8","v":"FOL"},"","3º ESO",{"$f":"CUPO!O$5","v":0},null,{"$f":"COUNTIF(CUPO!$R$5:$AA$5,B329)","v":0},0]
["Tutoría",{"$f":"'Otros Datos'!I9","v":"Francés"},"","3º ESO",{"$f":"CUPO!O$5","v":0},null,{"$f":"COUNTIF(CUPO!$R$5:$AA$5,B330)","v":0},0]
["Tutoría",{"$f":"'Otros Datos'!I10","v":"Geografía"},"","3º ESO",{"$f":"CUPO!O$5","v":0},null,{"$f":"COUNTIF(CUPO!$R$5:$AA$5,B331)","v":0},0]
["Tutoría",{"$f":"'Otros Datos'!I11","v":"Griego"},"","3º ESO",{"$f":"CUPO!O$5","v":0},null,{"$f":"COUNTIF(CUPO!$R$5:$AA$5,B332)","v":0},0]
["Tutoría",{"$f":"'Otros Datos'!I12","v":"Inglés"},"","3º ESO",{"$f":"CUPO!O$5","v":0},null,{"$f":"COUNTIF(CUPO!$R$5:$AA$5,B333)","v":0},0]
["Tutoría",{"$f":"'Otros Datos'!I13","v":"Latín"},"","3º ESO",{"$f":"CUPO!O$5","v":0},null,{"$f":"COUNTIF(CUPO!$R$5:$AA$5,B334)","v":0},0]
["Tutoría",{"$f":"'Otros Datos'!I14","v":"Lengua"},"","3º ESO",{"$f":"CUPO!O$5","v":0},null,{"$f":"COUNTIF(CUPO!$R$5:$AA$5,B335)","v":0},0]
["Tutoría",{"$f":"'Otros Datos'!I15","v":"Matemáticas"},"","3º ESO",{"$f":"CUPO!O$5","v":0},null,{"$f":"COUNTIF(CUPO!$R$5:$AA$5,B336)","v":0},0]
["Tutoría",{"$f":"'Otros Datos'!I16","v":"Música"},"","3º ESO",{"$f":"CUPO!O$5","v":0},null,{"$f":"COUNTIF(CUPO!$R$5:$AA$5,B337)","v":0},0]
["Tutoría",{"$f":"'Otros Datos'!I17","v":"Orientación"},"","3º ESO",{"$f":"CUPO!O$5","v":0},null,{"$f":"COUNTIF(CUPO!$R$5:$AA$5,B338)","v":0},0]
["Tutoría",{"$f":"'Otros Datos'!I18","v":"Tecnología"},"","3º ESO",{"$f":"CUPO!O$5","v":0},null,{"$f":"COUNTIF(CUPO!$R$5:$AA$5,B339)","v":0},0]
["Tutoría",{"$f":"'Otros Datos'!I19","v":"Depart 1"},"","3º ESO",{"$f":"CUPO!O$5","v":0},null,{"$f":"COUNTIF(CUPO!$R$5:$AA$5,B340)","v":0},0]
["Tutoría",{"$f":"'Otros Datos'!I20","v":"Depart 2"},"","3º ESO",{"$f":"CUPO!O$5","v":0},null,{"$f":"COUNTIF(CUPO!$R$5:$AA$5,B341)","v":0},0]
["Tutoría",{"$f":"'Otros Datos'!I21","v":"Depart 3"},"","3º ESO",{"$f":"CUPO!O$5","v":0},null,{"$f":"COUNTIF(CUPO!$R$5:$AA$5,B342)","v":0},0]
["Sin Religión",{"$f":"'Otros Datos'!I2","v":"Biología"},"","3º ESO",{"$f":"CUPO!O$16","v":0},null,{"$f":"COUNTIF(CUPO!$R$16:$AA$16,B343)","v":0},0]
["Sin Religión",{"$f":"'Otros Datos'!I3","v":"Economía"},"","3º ESO",{"$f":"CUPO!O$16","v":0},null,{"$f":"COUNTIF(CUPO!$R$16:$AA$16,B344)","v":0},0]
["Sin Religión",{"$f":"'Otros Datos'!I4","v":"Ed Física"},"","3º ESO",{"$f":"CUPO!O$16","v":0},null,{"$f":"COUNTIF(CUPO!$R$16:$AA$16,B345)","v":0},0]
["Sin Religión",{"$f":"'Otros Datos'!I5","v":"EPV"},"","3º ESO",{"$f":"CUPO!O$16","v":0},null,{"$f":"COUNTIF(CUPO!$R$16:$AA$16,B346)","v":0},0]
["Sin Religión",{"$f":"'Otros Datos'!I6","v":"Filosofía"},"","3º ESO",{"$f":"CUPO!O$16","v":0},null,{"$f":"COUNTIF(CUPO!$R$16:$AA$16,B347)","v":0},0]
["Sin Religión",{"$f":"'Otros Datos'!I7","v":"Física y Quim"},"","3º ESO",{"$f":"CUPO!O$16","v":0},null,{"$f":"COUNTIF(CUPO!$R$16:$AA$16,B348)","v":0},0]
["Sin Religión",{"$f":"'Otros Datos'!I8","v":"FOL"},"","3º ESO",{"$f":"CUPO!O$16","v":0},null,{"$f":"COUNTIF(CUPO!$R$16:$AA$16,B349)","v":0},0]
["Sin Religión",{"$f":"'Otros Datos'!I9","v":"Francés"},"","3º ESO",{"$f":"CUPO!O$16","v":0},null,{"$f":"COUNTIF(CUPO!$R$16:$AA$16,B350)","v":0},0]
["Sin Religión",{"$f":"'Otros Datos'!I10","v":"Geografía"},"","3º ESO",{"$f":"CUPO!O$16","v":0},null,{"$f":"COUNTIF(CUPO!$R$16:$AA$16,B351)","v":0},0]
["Sin Religión",{"$f":"'Otros Datos'!I11","v":"Griego"},"","3º ESO",{"$f":"CUPO!O$16","v":0},null,{"$f":"COUNTIF(CUPO!$R$16:$AA$16,B352)","v":0},0]
["Sin Religión",{"$f":"'Otros Datos'!I12","v":"Inglés"},"","3º ESO",{"$f":"CUPO!O$16","v":0},null,{"$f":"COUNTIF(CUPO!$R$16:$AA$16,B353)","v":0},0]
["Sin Religión",{"$f":"'Otros Datos'!I13","v":"Latín"},"","3º ESO",{"$f":"CUPO!O$16","v":0},null,{"$f":"COUNTIF(CUPO!$R$16:$AA$16,B354)","v":0},0]
["Sin Religión",{"$f":"'Otros Datos'!I14","v":"Lengua"},"","3º ESO",{"$f":"CUPO!O$16","v":0},null,{"$f":"COUNTIF(CUPO!$R$16:$AA$16,B355)","v":0},0]
["Sin Religión",{"$f":"'Otros Datos'!I15","v":"Matemáticas"},"","3º ESO",{"$f":"CUPO!O$16","v":0},null,{"$f":"COUNTIF(CUPO!$R$16:$AA$16,B356)","v":0},0]
["Sin Religión",{"$f":"'Otros Datos'!I16","v":"Música"},"","3º ESO",{"$f":"CUPO!O$16","v":0},null,{"$f":"COUNTIF(CUPO!$R$16:$AA$16,B357)","v":0},0]
["Sin Religión",{"$f":"'Otros Datos'!I17","v":"Orientación"},"","3º ESO",{"$f":"CUPO!O$16","v":0},null,{"$f":"COUNTIF(CUPO!$R$16:$AA$16,B358)","v":0},0]
["Sin Religión",{"$f":"'Otros Datos'!I18","v":"Tecnología"},"","3º ESO",{"$f":"CUPO!O$16","v":0},null,{"$f":"COUNTIF(CUPO!$R$16:$AA$16,B359)","v":0},0]
["Sin Religión",{"$f":"'Otros Datos'!I19","v":"Depart 1"},"","3º ESO",{"$f":"CUPO!O$16","v":0},null,{"$f":"COUNTIF(CUPO!$R$16:$AA$16,B360)","v":0},0]
["Sin Religión",{"$f":"'Otros Datos'!I20","v":"Depart 2"},"","3º ESO",{"$f":"CUPO!O$16","v":0},null,{"$f":"COUNTIF(CUPO!$R$16:$AA$16,B361)","v":0},0]
["Sin Religión",{"$f":"'Otros Datos'!I21","v":"Depart 3"},"","3º ESO",{"$f":"CUPO!O$16","v":0},null,{"$f":"COUNTIF(CUPO!$R$16:$AA$16,B362)","v":0},0]
["Tutoría",{"$f":"'Otros Datos'!I2","v":"Biología"},"","4º ESO",{"$f":"CUPO!O$6","v":0},null,{"$f":"COUNTIF(CUPO!$R$6:$AA$6,B363)","v":0},0]
["Tutoría",{"$f":"'Otros Datos'!I3","v":"Economía"},"","4º ESO",{"$f":"CUPO!O$6","v":0},null,{"$f":"COUNTIF(CUPO!$R$6:$AA$6,B364)","v":0},0]
["Tutoría",{"$f":"'Otros Datos'!I4","v":"Ed Física"},"","4º ESO",{"$f":"CUPO!O$6","v":0},null,{"$f":"COUNTIF(CUPO!$R$6:$AA$6,B365)","v":0},0]
["Tutoría",{"$f":"'Otros Datos'!I5","v":"EPV"},"","4º ESO",{"$f":"CUPO!O$6","v":0},null,{"$f":"COUNTIF(CUPO!$R$6:$AA$6,B366)","v":0},0]
["Tutoría",{"$f":"'Otros Datos'!I6","v":"Filosofía"},"","4º ESO",{"$f":"CUPO!O$6","v":0},null,{"$f":"COUNTIF(CUPO!$R$6:$AA$6,B367)","v":0},0]
["Tutoría",{"$f":"'Otros Datos'!I7","v":"Física y Quim"},"","4º ESO",{"$f":"CUPO!O$6","v":0},null,{"$f":"COUNTIF(CUPO!$R$6:$AA$6,B368)","v":0},0]
["Tutoría",{"$f":"'Otros Datos'!I8","v":"FOL"},"","4º ESO",{"$f":"CUPO!O$6","v":0},null,{"$f":"COUNTIF(CUPO!$R$6:$AA$6,B369)","v":0},0]
["Tutoría",{"$f":"'Otros Datos'!I9","v":"Francés"},"","4º ESO",{"$f":"CUPO!O$6","v":0},null,{"$f":"COUNTIF(CUPO!$R$6:$AA$6,B370)","v":0},0]
["Tutoría",{"$f":"'Otros Datos'!I10","v":"Geografía"},"","4º ESO",{"$f":"CUPO!O$6","v":0},null,{"$f":"COUNTIF(CUPO!$R$6:$AA$6,B371)","v":0},0]
["Tutoría",{"$f":"'Otros Datos'!I11","v":"Griego"},"","4º ESO",{"$f":"CUPO!O$6","v":0},null,{"$f":"COUNTIF(CUPO!$R$6:$AA$6,B372)","v":0},0]
["Tutoría",{"$f":"'Otros Datos'!I12","v":"Inglés"},"","4º ESO",{"$f":"CUPO!O$6","v":0},null,{"$f":"COUNTIF(CUPO!$R$6:$AA$6,B373)","v":0},{"$f":"E373*G373","v":0}]
["Tutoría",{"$f":"'Otros Datos'!I13","v":"Latín"},"","4º ESO",{"$f":"CUPO!O$6","v":0},null,{"$f":"COUNTIF(CUPO!$R$6:$AA$6,B374)","v":0},0]
["Tutoría",{"$f":"'Otros Datos'!I14","v":"Lengua"},"","4º ESO",{"$f":"CUPO!O$6","v":0},null,{"$f":"COUNTIF(CUPO!$R$6:$AA$6,B375)","v":0},0]
["Tutoría",{"$f":"'Otros Datos'!I15","v":"Matemáticas"},"","4º ESO",{"$f":"CUPO!O$6","v":0},null,{"$f":"COUNTIF(CUPO!$R$6:$AA$6,B376)","v":0},0]
["Tutoría",{"$f":"'Otros Datos'!I16","v":"Música"},"","4º ESO",{"$f":"CUPO!O$6","v":0},null,{"$f":"COUNTIF(CUPO!$R$6:$AA$6,B377)","v":0},0]
["Tutoría",{"$f":"'Otros Datos'!I17","v":"Orientación"},"","4º ESO",{"$f":"CUPO!O$6","v":0},null,{"$f":"COUNTIF(CUPO!$R$6:$AA$6,B378)","v":0},0]
["Tutoría",{"$f":"'Otros Datos'!I18","v":"Tecnología"},"","4º ESO",{"$f":"CUPO!O$6","v":0},null,{"$f":"COUNTIF(CUPO!$R$6:$AA$6,B379)","v":0},0]
["Tutoría",{"$f":"'Otros Datos'!I19","v":"Depart 1"},"","4º ESO",{"$f":"CUPO!O$6","v":0},null,{"$f":"COUNTIF(CUPO!$R$6:$AA$6,B380)","v":0},0]
["Tutoría",{"$f":"'Otros Datos'!I20","v":"Depart 2"},"","4º ESO",{"$f":"CUPO!O$6","v":0},null,{"$f":"COUNTIF(CUPO!$R$6:$AA$6,B381)","v":0},0]
["Tutoría",{"$f":"'Otros Datos'!I21","v":"Depart 3"},"","4º ESO",{"$f":"CUPO!O$6","v":0},null,{"$f":"COUNTIF(CUPO!$R$6:$AA$6,B382)","v":0},0]
["Sin Religión",{"$f":"'Otros Datos'!I2","v":"Biología"},"","4º ESO",{"$f":"CUPO!O$17","v":0},null,{"$f":"COUNTIF(CUPO!$R$17:$AA$17,B383)","v":0},0]
["Sin Religión",{"$f":"'Otros Datos'!I3","v":"Economía"},"","4º ESO",{"$f":"CUPO!O$17","v":0},null,{"$f":"COUNTIF(CUPO!$R$17:$AA$17,B384)","v":0},0]
["Sin Religión",{"$f":"'Otros Datos'!I4","v":"Ed Física"},"","4º ESO",{"$f":"CUPO!O$17","v":0},null,{"$f":"COUNTIF(CUPO!$R$17:$AA$17,B385)","v":0},0]
["Sin Religión",{"$f":"'Otros Datos'!I5","v":"EPV"},"","4º ESO",{"$f":"CUPO!O$17","v":0},null,{"$f":"COUNTIF(CUPO!$R$17:$AA$17,B386)","v":0},0]
["Sin Religión",{"$f":"'Otros Datos'!I6","v":"Filosofía"},"","4º ESO",{"$f":"CUPO!O$17","v":0},null,{"$f":"COUNTIF(CUPO!$R$17:$AA$17,B387)","v":0},0]
["Sin Religión",{"$f":"'Otros Datos'!I7","v":"Física y Quim"},{"$f":"IF(H388<>0,B388,\"\")","v":""},"4º ESO",{"$f":"CUPO!O$17","v":0},null,{"$f":"COUNTIF(CUPO!$R$17:$AA$17,B388)","v":0},0]
["Sin Religión",{"$f":"'Otros Datos'!I8","v":"FOL"},"","4º ESO",{"$f":"CUPO!O$17","v":0},null,{"$f":"COUNTIF(CUPO!$R$17:$AA$17,B389)","v":0},0]
["Sin Religión",{"$f":"'Otros Datos'!I9","v":"Francés"},"","4º ESO",{"$f":"CUPO!O$17","v":0},null,{"$f":"COUNTIF(CUPO!$R$17:$AA$17,B390)","v":0},0]
["Sin Religión",{"$f":"'Otros Datos'!I10","v":"Geografía"},"","4º ESO",{"$f":"CUPO!O$17","v":0},null,{"$f":"COUNTIF(CUPO!$R$17:$AA$17,B391)","v":0},0]
["Sin Religión",{"$f":"'Otros Datos'!I11","v":"Griego"},"","4º ESO",{"$f":"CUPO!O$17","v":0},null,{"$f":"COUNTIF(CUPO!$R$17:$AA$17,B392)","v":0},0]
["Sin Religión",{"$f":"'Otros Datos'!I12","v":"Inglés"},"","4º ESO",{"$f":"CUPO!O$17","v":0},null,{"$f":"COUNTIF(CUPO!$R$17:$AA$17,B393)","v":0},0]
["Sin Religión",{"$f":"'Otros Datos'!I13","v":"Latín"},"","4º ESO",{"$f":"CUPO!O$17","v":0},null,{"$f":"COUNTIF(CUPO!$R$17:$AA$17,B394)","v":0},0]
["Sin Religión",{"$f":"'Otros Datos'!I14","v":"Lengua"},"","4º ESO",{"$f":"CUPO!O$17","v":0},null,{"$f":"COUNTIF(CUPO!$R$17:$AA$17,B395)","v":0},0]
["Sin Religión",{"$f":"'Otros Datos'!I15","v":"Matemáticas"},"","4º ESO",{"$f":"CUPO!O$17","v":0},null,{"$f":"COUNTIF(CUPO!$R$17:$AA$17,B396)","v":0},0]
["Sin Religión",{"$f":"'Otros Datos'!I16","v":"Música"},"","4º ESO",{"$f":"CUPO!O$17","v":0},null,{"$f":"COUNTIF(CUPO!$R$17:$AA$17,B397)","v":0},0]
["Sin Religión",{"$f":"'Otros Datos'!I17","v":"Orientación"},"","4º ESO",{"$f":"CUPO!O$17","v":0},null,{"$f":"COUNTIF(CUPO!$R$17:$AA$17,B398)","v":0},0]
["Sin Religión",{"$f":"'Otros Datos'!I18","v":"Tecnología"},"","4º ESO",{"$f":"CUPO!O$17","v":0},null,{"$f":"COUNTIF(CUPO!$R$17:$AA$17,B399)","v":0},0]
["Sin Religión",{"$f":"'Otros Datos'!I19","v":"Depart 1"},"","4º ESO",{"$f":"CUPO!O$17","v":0},null,{"$f":"COUNTIF(CUPO!$R$17:$AA$17,B400)","v":0},0]
["Sin Religión",{"$f":"'Otros Datos'!I20","v":"Depart 2"},"","4º ESO",{"$f":"CUPO!O$17","v":0},null,{"$f":"COUNTIF(CUPO!$R$17:$AA$17,B401)","v":0},0]
["Sin Religión",{"$f":"'Otros Datos'!I21","v":"Depart 3"},"","4º ESO",{"$f":"CUPO!O$17","v":0},null,{"$f":"COUNTIF(CUPO!$R$17:$AA$17,B402)","v":0},0]
["Tutoría",{"$f":"'Otros Datos'!I2","v":"Biología"},"","1º BACH",{"$f":"CUPO!O$7","v":0},null,{"$f":"COUNTIF(CUPO!$R$7:$AA$7,B403)","v":0},0]
["Tutoría",{"$f":"'Otros Datos'!I3","v":"Economía"},"","1º BACH",{"$f":"CUPO!O$7","v":0},null,{"$f":"COUNTIF(CUPO!$R$7:$AA$7,B404)","v":0},0]
["Tutoría",{"$f":"'Otros Datos'!I4","v":"Ed Física"},"","1º BACH",{"$f":"CUPO!O$7","v":0},null,{"$f":"COUNTIF(CUPO!$R$7:$AA$7,B405)","v":0},0]
["Tutoría",{"$f":"'Otros Datos'!I5","v":"EPV"},"","1º BACH",{"$f":"CUPO!O$7","v":0},null,{"$f":"COUNTIF(CUPO!$R$7:$AA$7,B406)","v":0},0]
["Tutoría",{"$f":"'Otros Datos'!I6","v":"Filosofía"},"","1º BACH",{"$f":"CUPO!O$7","v":0},null,{"$f":"COUNTIF(CUPO!$R$7:$AA$7,B407)","v":0},0]
["Tutoría",{"$f":"'Otros Datos'!I7","v":"Física y Quim"},"","1º BACH",{"$f":"CUPO!O$7","v":0},null,{"$f":"COUNTIF(CUPO!$R$7:$AA$7,B408)","v":0},0]
["Tutoría",{"$f":"'Otros Datos'!I8","v":"FOL"},"","1º BACH",{"$f":"CUPO!O$7","v":0},null,{"$f":"COUNTIF(CUPO!$R$7:$AA$7,B409)","v":0},0]
["Tutoría",{"$f":"'Otros Datos'!I9","v":"Francés"},"","1º BACH",{"$f":"CUPO!O$7","v":0},null,{"$f":"COUNTIF(CUPO!$R$7:$AA$7,B410)","v":0},0]
["Tutoría",{"$f":"'Otros Datos'!I10","v":"Geografía"},"","1º BACH",{"$f":"CUPO!O$7","v":0},null,{"$f":"COUNTIF(CUPO!$R$7:$AA$7,B411)","v":0},0]
["Tutoría",{"$f":"'Otros Datos'!I11","v":"Griego"},"","1º BACH",{"$f":"CUPO!O$7","v":0},null,{"$f":"COUNTIF(CUPO!$R$7:$AA$7,B412)","v":0},0]
["Tutoría",{"$f":"'Otros Datos'!I12","v":"Inglés"},"","1º BACH",{"$f":"CUPO!O$7","v":0},null,{"$f":"COUNTIF(CUPO!$R$7:$AA$7,B413)","v":0},0]
["Tutoría",{"$f":"'Otros Datos'!I13","v":"Latín"},"","1º BACH",{"$f":"CUPO!O$7","v":0},null,{"$f":"COUNTIF(CUPO!$R$7:$AA$7,B414)","v":0},0]
["Tutoría",{"$f":"'Otros Datos'!I14","v":"Lengua"},"","1º BACH",{"$f":"CUPO!O$7","v":0},null,{"$f":"COUNTIF(CUPO!$R$7:$AA$7,B415)","v":0},0]
["Tutoría",{"$f":"'Otros Datos'!I15","v":"Matemáticas"},"","1º BACH",{"$f":"CUPO!O$7","v":0},null,{"$f":"COUNTIF(CUPO!$R$7:$AA$7,B416)","v":0},0]
["Tutoría",{"$f":"'Otros Datos'!I16","v":"Música"},"","1º BACH",{"$f":"CUPO!O$7","v":0},null,{"$f":"COUNTIF(CUPO!$R$7:$AA$7,B417)","v":0},0]
["Tutoría",{"$f":"'Otros Datos'!I17","v":"Orientación"},"","1º BACH",{"$f":"CUPO!O$7","v":0},null,{"$f":"COUNTIF(CUPO!$R$7:$AA$7,B418)","v":0},0]
["Tutoría",{"$f":"'Otros Datos'!I18","v":"Tecnología"},"","1º BACH",{"$f":"CUPO!O$7","v":0},null,{"$f":"COUNTIF(CUPO!$R$7:$AA$7,B419)","v":0},0]
["Tutoría",{"$f":"'Otros Datos'!I19","v":"Depart 1"},"","1º BACH",{"$f":"CUPO!O$7","v":0},null,{"$f":"COUNTIF(CUPO!$R$7:$AA$7,B420)","v":0},0]
["Tutoría",{"$f":"'Otros Datos'!I20","v":"Depart 2"},"","1º BACH",{"$f":"CUPO!O$7","v":0},null,{"$f":"COUNTIF(CUPO!$R$7:$AA$7,B421)","v":0},0]
["Tutoría",{"$f":"'Otros Datos'!I21","v":"Depart 3"},"","1º BACH",{"$f":"CUPO!O$7","v":0},null,{"$f":"COUNTIF(CUPO!$R$7:$AA$7,B422)","v":0},0]
["Sin Religión",{"$f":"'Otros Datos'!I2","v":"Biología"},"","1º BACH",{"$f":"CUPO!O$18","v":0},null,{"$f":"COUNTIF(CUPO!$R$18:$AA$18,B423)","v":0},0]
["Sin Religión",{"$f":"'Otros Datos'!I3","v":"Economía"},"","1º BACH",{"$f":"CUPO!O$18","v":0},null,{"$f":"COUNTIF(CUPO!$R$18:$AA$18,B424)","v":0},0]
["Sin Religión",{"$f":"'Otros Datos'!I4","v":"Ed Física"},"","1º BACH",{"$f":"CUPO!O$18","v":0},null,{"$f":"COUNTIF(CUPO!$R$18:$AA$18,B425)","v":0},0]
["Sin Religión",{"$f":"'Otros Datos'!I5","v":"EPV"},"","1º BACH",{"$f":"CUPO!O$18","v":0},null,{"$f":"COUNTIF(CUPO!$R$18:$AA$18,B426)","v":0},0]
["Sin Religión",{"$f":"'Otros Datos'!I6","v":"Filosofía"},"","1º BACH",{"$f":"CUPO!O$18","v":0},null,{"$f":"COUNTIF(CUPO!$R$18:$AA$18,B427)","v":0},0]
["Sin Religión",{"$f":"'Otros Datos'!I7","v":"Física y Quim"},"","1º BACH",{"$f":"CUPO!O$18","v":0},null,{"$f":"COUNTIF(CUPO!$R$18:$AA$18,B428)","v":0},0]
["Sin Religión",{"$f":"'Otros Datos'!I8","v":"FOL"},"","1º BACH",{"$f":"CUPO!O$18","v":0},null,{"$f":"COUNTIF(CUPO!$R$18:$AA$18,B429)","v":0},0]
["Sin Religión",{"$f":"'Otros Datos'!I9","v":"Francés"},"","1º BACH",{"$f":"CUPO!O$18","v":0},null,{"$f":"COUNTIF(CUPO!$R$18:$AA$18,B430)","v":0},0]
["Sin Religión",{"$f":"'Otros Datos'!I10","v":"Geografía"},"","1º BACH",{"$f":"CUPO!O$18","v":0},null,{"$f":"COUNTIF(CUPO!$R$18:$AA$18,B431)","v":0},0]
["Sin Religión",{"$f":"'Otros Datos'!I11","v":"Griego"},"","1º BACH",{"$f":"CUPO!O$18","v":0},null,{"$f":"COUNTIF(CUPO!$R$18:$AA$18,B432)","v":0},0]
["Sin Religión",{"$f":"'Otros Datos'!I12","v":"Inglés"},"","1º BACH",{"$f":"CUPO!O$18","v":0},null,{"$f":"COUNTIF(CUPO!$R$18:$AA$18,B433)","v":0},0]
["Sin Religión",{"$f":"'Otros Datos'!I13","v":"Latín"},"","1º BACH",{"$f":"CUPO!O$18","v":0},null,{"$f":"COUNTIF(CUPO!$R$18:$AA$18,B434)","v":0},0]
["Sin Religión",{"$f":"'Otros Datos'!I14","v":"Lengua"},"","1º BACH",{"$f":"CUPO!O$18","v":0},null,{"$f":"COUNTIF(CUPO!$R$18:$AA$18,B435)","v":0},0]
["Sin Religión",{"$f":"'Otros Datos'!I15","v":"Matemáticas"},"","1º BACH",{"$f":"CUPO!O$18","v":0},null,{"$f":"COUNTIF(CUPO!$R$18:$AA$18,B436)","v":0},0]
["Sin Religión",{"$f":"'Otros Datos'!I16","v":"Música"},"","1º BACH",{"$f":"CUPO!O$18","v":0},null,{"$f":"COUNTIF(CUPO!$R$18:$AA$18,B437)","v":0},{"$f":"E437*G437","v":0}]
["Sin Religión",{"$f":"'Otros Datos'!I17","v":"Orientación"},"","1º BACH",{"$f":"CUPO!O$18","v":0},null,{"$f":"COUNTIF(CUPO!$R$18:$AA$18,B438)","v":0},0]
["Sin Religión",{"$f":"'Otros Datos'!I18","v":"Tecnología"},"","1º BACH",{"$f":"CUPO!O$18","v":0},null,{"$f":"COUNTIF(CUPO!$R$18:$AA$18,B439)","v":0},0]
["Sin Religión",{"$f":"'Otros Datos'!I19","v":"Depart 1"},"","1º BACH",{"$f":"CUPO!O$18","v":0},null,{"$f":"COUNTIF(CUPO!$R$18:$AA$18,B440)","v":0},0]
["Sin Religión",{"$f":"'Otros Datos'!I20","v":"Depart 2"},"","1º BACH",{"$f":"CUPO!O$18","v":0},null,{"$f":"COUNTIF(CUPO!$R$18:$AA$18,B441)","v":0},0]
["Sin Religión",{"$f":"'Otros Datos'!I21","v":"Depart 3"},"","1º BACH",{"$f":"CUPO!O$18","v":0},null,{"$f":"COUNTIF(CUPO!$R$18:$AA$18,B442)","v":0},0]
["Tutoría",{"$f":"'Otros Datos'!I2","v":"Biología"},"","2º BACH",{"$f":"CUPO!O$8","v":0},null,{"$f":"COUNTIF(CUPO!$R$8:$AA$8,B443)","v":0},0]
["Tutoría",{"$f":"'Otros Datos'!I3","v":"Economía"},"","2º BACH",{"$f":"CUPO!O$8","v":0},null,{"$f":"COUNTIF(CUPO!$R$8:$AA$8,B444)","v":0},0]
["Tutoría",{"$f":"'Otros Datos'!I4","v":"Ed Física"},"","2º BACH",{"$f":"CUPO!O$8","v":0},null,{"$f":"COUNTIF(CUPO!$R$8:$AA$8,B445)","v":0},0]
["Tutoría",{"$f":"'Otros Datos'!I5","v":"EPV"},"","2º BACH",{"$f":"CUPO!O$8","v":0},null,{"$f":"COUNTIF(CUPO!$R$8:$AA$8,B446)","v":0},0]
["Tutoría",{"$f":"'Otros Datos'!I6","v":"Filosofía"},"","2º BACH",{"$f":"CUPO!O$8","v":0},null,{"$f":"COUNTIF(CUPO!$R$8:$AA$8,B447)","v":0},0]
["Tutoría",{"$f":"'Otros Datos'!I7","v":"Física y Quim"},"","2º BACH",{"$f":"CUPO!O$8","v":0},null,{"$f":"COUNTIF(CUPO!$R$8:$AA$8,B448)","v":0},0]
["Tutoría",{"$f":"'Otros Datos'!I8","v":"FOL"},"","2º BACH",{"$f":"CUPO!O$8","v":0},null,{"$f":"COUNTIF(CUPO!$R$8:$AA$8,B449)","v":0},0]
["Tutoría",{"$f":"'Otros Datos'!I9","v":"Francés"},"","2º BACH",{"$f":"CUPO!O$8","v":0},null,{"$f":"COUNTIF(CUPO!$R$8:$AA$8,B450)","v":0},0]
["Tutoría",{"$f":"'Otros Datos'!I10","v":"Geografía"},"","2º BACH",{"$f":"CUPO!O$8","v":0},null,{"$f":"COUNTIF(CUPO!$R$8:$AA$8,B451)","v":0},0]
["Tutoría",{"$f":"'Otros Datos'!I11","v":"Griego"},{"$f":"IF(H452<>0,B452,\"\")","v":""},"2º BACH",{"$f":"CUPO!O$8","v":0},null,{"$f":"COUNTIF(CUPO!$R$8:$AA$8,B452)","v":0},0]
["Tutoría",{"$f":"'Otros Datos'!I12","v":"Inglés"},"","2º BACH",{"$f":"CUPO!O$8","v":0},null,{"$f":"COUNTIF(CUPO!$R$8:$AA$8,B453)","v":0},0]
["Tutoría",{"$f":"'Otros Datos'!I13","v":"Latín"},"","2º BACH",{"$f":"CUPO!O$8","v":0},null,{"$f":"COUNTIF(CUPO!$R$8:$AA$8,B454)","v":0},0]
["Tutoría",{"$f":"'Otros Datos'!I14","v":"Lengua"},"","2º BACH",{"$f":"CUPO!O$8","v":0},null,{"$f":"COUNTIF(CUPO!$R$8:$AA$8,B455)","v":0},0]
["Tutoría",{"$f":"'Otros Datos'!I15","v":"Matemáticas"},"","2º BACH",{"$f":"CUPO!O$8","v":0},null,{"$f":"COUNTIF(CUPO!$R$8:$AA$8,B456)","v":0},0]
["Tutoría",{"$f":"'Otros Datos'!I16","v":"Música"},"","2º BACH",{"$f":"CUPO!O$8","v":0},null,{"$f":"COUNTIF(CUPO!$R$8:$AA$8,B457)","v":0},0]
["Tutoría",{"$f":"'Otros Datos'!I17","v":"Orientación"},"","2º BACH",{"$f":"CUPO!O$8","v":0},null,{"$f":"COUNTIF(CUPO!$R$8:$AA$8,B458)","v":0},0]
["Tutoría",{"$f":"'Otros Datos'!I18","v":"Tecnología"},"","2º BACH",{"$f":"CUPO!O$8","v":0},null,{"$f":"COUNTIF(CUPO!$R$8:$AA$8,B459)","v":0},0]
["Tutoría",{"$f":"'Otros Datos'!I19","v":"Depart 1"},"","2º BACH",{"$f":"CUPO!O$8","v":0},null,{"$f":"COUNTIF(CUPO!$R$8:$AA$8,B460)","v":0},0]
["Tutoría",{"$f":"'Otros Datos'!I20","v":"Depart 2"},"","2º BACH",{"$f":"CUPO!O$8","v":0},null,{"$f":"COUNTIF(CUPO!$R$8:$AA$8,B461)","v":0},0]
["Tutoría",{"$f":"'Otros Datos'!I21","v":"Depart 3"},"","2º BACH",{"$f":"CUPO!O$8","v":0},null,{"$f":"COUNTIF(CUPO!$R$8:$AA$8,B462)","v":0},0]
["Sin Religión",{"$f":"'Otros Datos'!I2","v":"Biología"},"","2º BACH",{"$f":"CUPO!O$19","v":0},null,{"$f":"COUNTIF(CUPO!$R$19:$AA$19,B463)","v":0},0]
["Sin Religión",{"$f":"'Otros Datos'!I3","v":"Economía"},"","2º BACH",{"$f":"CUPO!O$19","v":0},null,{"$f":"COUNTIF(CUPO!$R$19:$AA$19,B464)","v":0},0]
["Sin Religión",{"$f":"'Otros Datos'!I4","v":"Ed Física"},"","2º BACH",{"$f":"CUPO!O$19","v":0},null,{"$f":"COUNTIF(CUPO!$R$19:$AA$19,B465)","v":0},0]
["Sin Religión",{"$f":"'Otros Datos'!I5","v":"EPV"},"","2º BACH",{"$f":"CUPO!O$19","v":0},null,{"$f":"COUNTIF(CUPO!$R$19:$AA$19,B466)","v":0},0]
["Sin Religión",{"$f":"'Otros Datos'!I6","v":"Filosofía"},"","2º BACH",{"$f":"CUPO!O$19","v":0},null,{"$f":"COUNTIF(CUPO!$R$19:$AA$19,B467)","v":0},0]
["Sin Religión",{"$f":"'Otros Datos'!I7","v":"Física y Quim"},"","2º BACH",{"$f":"CUPO!O$19","v":0},null,{"$f":"COUNTIF(CUPO!$R$19:$AA$19,B468)","v":0},0]
["Sin Religión",{"$f":"'Otros Datos'!I8","v":"FOL"},"","2º BACH",{"$f":"CUPO!O$19","v":0},null,{"$f":"COUNTIF(CUPO!$R$19:$AA$19,B469)","v":0},0]
["Sin Religión",{"$f":"'Otros Datos'!I9","v":"Francés"},"","2º BACH",{"$f":"CUPO!O$19","v":0},null,{"$f":"COUNTIF(CUPO!$R$19:$AA$19,B470)","v":0},0]
["Sin Religión",{"$f":"'Otros Datos'!I10","v":"Geografía"},"","2º BACH",{"$f":"CUPO!O$19","v":0},null,{"$f":"COUNTIF(CUPO!$R$19:$AA$19,B471)","v":0},0]
["Sin Religión",{"$f":"'Otros Datos'!I11","v":"Griego"},"","2º BACH",{"$f":"CUPO!O$19","v":0},null,{"$f":"COUNTIF(CUPO!$R$19:$AA$19,B472)","v":0},0]
["Sin Religión",{"$f":"'Otros Datos'!I12","v":"Inglés"},"","2º BACH",{"$f":"CUPO!O$19","v":0},null,{"$f":"COUNTIF(CUPO!$R$19:$AA$19,B473)","v":0},0]
["Sin Religión",{"$f":"'Otros Datos'!I13","v":"Latín"},"","2º BACH",{"$f":"CUPO!O$19","v":0},null,{"$f":"COUNTIF(CUPO!$R$19:$AA$19,B474)","v":0},0]
["Sin Religión",{"$f":"'Otros Datos'!I14","v":"Lengua"},"","2º BACH",{"$f":"CUPO!O$19","v":0},null,{"$f":"COUNTIF(CUPO!$R$19:$AA$19,B475)","v":0},0]
["Sin Religión",{"$f":"'Otros Datos'!I15","v":"Matemáticas"},"","2º BACH",{"$f":"CUPO!O$19","v":0},null,{"$f":"COUNTIF(CUPO!$R$19:$AA$19,B476)","v":0},0]
["Sin Religión",{"$f":"'Otros Datos'!I16","v":"Música"},"","2º BACH",{"$f":"CUPO!O$19","v":0},null,{"$f":"COUNTIF(CUPO!$R$19:$AA$19,B477)","v":0},0]
["Sin Religión",{"$f":"'Otros Datos'!I17","v":"Orientación"},"","2º BACH",{"$f":"CUPO!O$19","v":0},null,{"$f":"COUNTIF(CUPO!$R$19:$AA$19,B478)","v":0},0]
["Sin Religión",{"$f":"'Otros Datos'!I18","v":"Tecnología"},"","2º BACH",{"$f":"CUPO!O$19","v":0},null,{"$f":"COUNTIF(CUPO!$R$19:$AA$19,B479)","v":0},0]
["Sin Religión",{"$f":"'Otros Datos'!I19","v":"Depart 1"},"","2º BACH",{"$f":"CUPO!O$19","v":0},null,{"$f":"COUNTIF(CUPO!$R$19:$AA$19,B480)","v":0},0]
["Sin Religión",{"$f":"'Otros Datos'!I20","v":"Depart 2"},"","2º BACH",{"$f":"CUPO!O$19","v":0},null,{"$f":"COUNTIF(CUPO!$R$19:$AA$19,B481)","v":0},0]
["Sin Religión",{"$f":"'Otros Datos'!I21","v":"Depart 3"},"","2º BACH",{"$f":"CUPO!O$19","v":0},null,{"$f":"COUNTIF(CUPO!$R$19:$AA$19,B482)","v":0},0]
["Tutoría",{"$f":"'Otros Datos'!I2","v":"Biología"},"","PMAR1",{"$f":"CUPO!$O$9","v":0},null,{"$f":"COUNTIF(CUPO!$R$9:$AA$9,B483)","v":0},0]
["Tutoría",{"$f":"'Otros Datos'!I3","v":"Economía"},"","PMAR1",{"$f":"CUPO!$O$9","v":0},null,{"$f":"COUNTIF(CUPO!$R$9:$AA$9,B484)","v":0},0]
["Tutoría",{"$f":"'Otros Datos'!I4","v":"Ed Física"},"","PMAR1",{"$f":"CUPO!$O$9","v":0},null,{"$f":"COUNTIF(CUPO!$R$9:$AA$9,B485)","v":0},0]
["Tutoría",{"$f":"'Otros Datos'!I5","v":"EPV"},"","PMAR1",{"$f":"CUPO!$O$9","v":0},null,{"$f":"COUNTIF(CUPO!$R$9:$AA$9,B486)","v":0},0]
["Tutoría",{"$f":"'Otros Datos'!I6","v":"Filosofía"},"","PMAR1",{"$f":"CUPO!$O$9","v":0},null,{"$f":"COUNTIF(CUPO!$R$9:$AA$9,B487)","v":0},0]
["Tutoría",{"$f":"'Otros Datos'!I7","v":"Física y Quim"},"","PMAR1",{"$f":"CUPO!$O$9","v":0},null,{"$f":"COUNTIF(CUPO!$R$9:$AA$9,B488)","v":0},0]
["Tutoría",{"$f":"'Otros Datos'!I8","v":"FOL"},"","PMAR1",{"$f":"CUPO!$O$9","v":0},null,{"$f":"COUNTIF(CUPO!$R$9:$AA$9,B489)","v":0},0]
["Tutoría",{"$f":"'Otros Datos'!I9","v":"Francés"},"","PMAR1",{"$f":"CUPO!$O$9","v":0},null,{"$f":"COUNTIF(CUPO!$R$9:$AA$9,B490)","v":0},0]
["Tutoría",{"$f":"'Otros Datos'!I10","v":"Geografía"},"","PMAR1",{"$f":"CUPO!$O$9","v":0},null,{"$f":"COUNTIF(CUPO!$R$9:$AA$9,B491)","v":0},0]
["Tutoría",{"$f":"'Otros Datos'!I11","v":"Griego"},"","PMAR1",{"$f":"CUPO!$O$9","v":0},null,{"$f":"COUNTIF(CUPO!$R$9:$AA$9,B492)","v":0},0]
["Tutoría",{"$f":"'Otros Datos'!I12","v":"Inglés"},"","PMAR1",{"$f":"CUPO!$O$9","v":0},null,{"$f":"COUNTIF(CUPO!$R$9:$AA$9,B493)","v":0},0]
["Tutoría",{"$f":"'Otros Datos'!I13","v":"Latín"},"","PMAR1",{"$f":"CUPO!$O$9","v":0},null,{"$f":"COUNTIF(CUPO!$R$9:$AA$9,B494)","v":0},0]
["Tutoría",{"$f":"'Otros Datos'!I14","v":"Lengua"},"","PMAR1",{"$f":"CUPO!$O$9","v":0},null,{"$f":"COUNTIF(CUPO!$R$9:$AA$9,B495)","v":0},0]
["Tutoría",{"$f":"'Otros Datos'!I15","v":"Matemáticas"},"","PMAR1",{"$f":"CUPO!$O$9","v":0},null,{"$f":"COUNTIF(CUPO!$R$9:$AA$9,B496)","v":0},0]
["Tutoría",{"$f":"'Otros Datos'!I16","v":"Música"},"","PMAR1",{"$f":"CUPO!$O$9","v":0},null,{"$f":"COUNTIF(CUPO!$R$9:$AA$9,B497)","v":0},0]
["Tutoría",{"$f":"'Otros Datos'!I17","v":"Orientación"},"","PMAR1",{"$f":"CUPO!$O$9","v":0},null,{"$f":"COUNTIF(CUPO!$R$9:$AA$9,B498)","v":0},0]
["Tutoría",{"$f":"'Otros Datos'!I18","v":"Tecnología"},"","PMAR1",{"$f":"CUPO!$O$9","v":0},null,{"$f":"COUNTIF(CUPO!$R$9:$AA$9,B499)","v":0},0]
["Tutoría",{"$f":"'Otros Datos'!I19","v":"Depart 1"},"","PMAR1",{"$f":"CUPO!$O$9","v":0},null,{"$f":"COUNTIF(CUPO!$R$9:$AA$9,B500)","v":0},0]
["Tutoría",{"$f":"'Otros Datos'!I20","v":"Depart 2"},"","PMAR1",{"$f":"CUPO!$O$9","v":0},null,{"$f":"COUNTIF(CUPO!$R$9:$AA$9,B501)","v":0},{"$f":"E501*G501","v":0}]
["Tutoría",{"$f":"'Otros Datos'!I21","v":"Depart 3"},"","PMAR1",{"$f":"CUPO!$O$9","v":0},null,{"$f":"COUNTIF(CUPO!$R$9:$AA$9,B502)","v":0},0]
["Tutoría",{"$f":"'Otros Datos'!I2","v":"Biología"},"","PMAR2",{"$f":"CUPO!$O$10","v":0},null,{"$f":"COUNTIF(CUPO!$R$10:$AA$10,B503)","v":0},0]
["Tutoría",{"$f":"'Otros Datos'!I3","v":"Economía"},"","PMAR2",{"$f":"CUPO!$O$10","v":0},null,{"$f":"COUNTIF(CUPO!$R$10:$AA$10,B504)","v":0},0]
["Tutoría",{"$f":"'Otros Datos'!I4","v":"Ed Física"},"","PMAR2",{"$f":"CUPO!$O$10","v":0},null,{"$f":"COUNTIF(CUPO!$R$10:$AA$10,B505)","v":0},0]
["Tutoría",{"$f":"'Otros Datos'!I5","v":"EPV"},"","PMAR2",{"$f":"CUPO!$O$10","v":0},null,{"$f":"COUNTIF(CUPO!$R$10:$AA$10,B506)","v":0},0]
["Tutoría",{"$f":"'Otros Datos'!I6","v":"Filosofía"},"","PMAR2",{"$f":"CUPO!$O$10","v":0},null,{"$f":"COUNTIF(CUPO!$R$10:$AA$10,B507)","v":0},0]
["Tutoría",{"$f":"'Otros Datos'!I7","v":"Física y Quim"},"","PMAR2",{"$f":"CUPO!$O$10","v":0},null,{"$f":"COUNTIF(CUPO!$R$10:$AA$10,B508)","v":0},0]
["Tutoría",{"$f":"'Otros Datos'!I8","v":"FOL"},"","PMAR2",{"$f":"CUPO!$O$10","v":0},null,{"$f":"COUNTIF(CUPO!$R$10:$AA$10,B509)","v":0},0]
["Tutoría",{"$f":"'Otros Datos'!I9","v":"Francés"},"","PMAR2",{"$f":"CUPO!$O$10","v":0},null,{"$f":"COUNTIF(CUPO!$R$10:$AA$10,B510)","v":0},0]
["Tutoría",{"$f":"'Otros Datos'!I10","v":"Geografía"},"","PMAR2",{"$f":"CUPO!$O$10","v":0},null,{"$f":"COUNTIF(CUPO!$R$10:$AA$10,B511)","v":0},0]
["Tutoría",{"$f":"'Otros Datos'!I11","v":"Griego"},"","PMAR2",{"$f":"CUPO!$O$10","v":0},null,{"$f":"COUNTIF(CUPO!$R$10:$AA$10,B512)","v":0},0]
["Tutoría",{"$f":"'Otros Datos'!I12","v":"Inglés"},"","PMAR2",{"$f":"CUPO!$O$10","v":0},null,{"$f":"COUNTIF(CUPO!$R$10:$AA$10,B513)","v":0},0]
["Tutoría",{"$f":"'Otros Datos'!I13","v":"Latín"},"","PMAR2",{"$f":"CUPO!$O$10","v":0},null,{"$f":"COUNTIF(CUPO!$R$10:$AA$10,B514)","v":0},0]
["Tutoría",{"$f":"'Otros Datos'!I14","v":"Lengua"},"","PMAR2",{"$f":"CUPO!$O$10","v":0},null,{"$f":"COUNTIF(CUPO!$R$10:$AA$10,B515)","v":0},0]
["Tutoría",{"$f":"'Otros Datos'!I15","v":"Matemáticas"},{"$f":"IF(H516<>0,B516,\"\")","v":""},"PMAR2",{"$f":"CUPO!$O$10","v":0},null,{"$f":"COUNTIF(CUPO!$R$10:$AA$10,B516)","v":0},0]
["Tutoría",{"$f":"'Otros Datos'!I16","v":"Música"},"","PMAR2",{"$f":"CUPO!$O$10","v":0},null,{"$f":"COUNTIF(CUPO!$R$10:$AA$10,B517)","v":0},0]
["Tutoría",{"$f":"'Otros Datos'!I17","v":"Orientación"},"","PMAR2",{"$f":"CUPO!$O$10","v":0},null,{"$f":"COUNTIF(CUPO!$R$10:$AA$10,B518)","v":0},0]
["Tutoría",{"$f":"'Otros Datos'!I18","v":"Tecnología"},"","PMAR2",{"$f":"CUPO!$O$10","v":0},null,{"$f":"COUNTIF(CUPO!$R$10:$AA$10,B519)","v":0},0]
["Tutoría",{"$f":"'Otros Datos'!I19","v":"Depart 1"},"","PMAR2",{"$f":"CUPO!$O$10","v":0},null,{"$f":"COUNTIF(CUPO!$R$10:$AA$10,B520)","v":0},0]
["Tutoría",{"$f":"'Otros Datos'!I20","v":"Depart 2"},"","PMAR2",{"$f":"CUPO!$O$10","v":0},null,{"$f":"COUNTIF(CUPO!$R$10:$AA$10,B521)","v":0},0]
["Tutoría",{"$f":"'Otros Datos'!I21","v":"Depart 3"},"","PMAR2",{"$f":"CUPO!$O$10","v":0},null,{"$f":"COUNTIF(CUPO!$R$10:$AA$10,B522)","v":0},0]